{"text_format":"1","workbook":"xlsx","n_sheets":20,"sheets":["出場チーム","要項","組合せ抽選用","会場図","MCM資料","累積警告・退場","予選リーグ","予選リーグ (2)","予選リーグ公式記録(A北)","予選リーグ公式記録(A南)","予選リーグ公式記録(B北)","予選リーグ公式記録(B南)","決勝トーナメント","決勝T公式記録","準決勝公式記録No,29","準決勝公式記録No,31","決勝公式記録 No,33","審判員","選手名簿","項目"],"not_rendered":{"charts":0,"images":2,"macros":1,"external_links":0,"defined_names":9,"comments":0,"pivot_tables":0},"unopened":[],"bounds":{"document_bytes":16777216,"sheet_cells":100000,"rows_first":2000,"rows_last":500,"rows_between":2000,"halvings":0,"cell_chars":16384,"cell_head_chars":4096},"cells_cut":0,"cells_raw":0,"read":"whole","date_system":"1900"}

{"sheet":"出場チーム","index":0,"n_rows":40,"n_cols":12,"rows_kept":40,"cut":false,"hidden":false,"merged":[[39,1,39,4],[39,5,39,8],[39,9,39,11],[0,0,0,8],[0,9,0,11],[38,1,38,4],[38,5,38,8],[38,9,38,11],[14,7,15,7],[10,0,20,0],[12,7,13,7],[10,7,11,7],[16,7,17,7]]}
[{"$f":"要項!C2","v":"OFA 第 30 回 大分県ジュニアサッカー選手権大会"},null,null,null,null,null,null,null,null,"抽選会"]
[]
["１．日時",{"$f":"要項!C50","v":"11月25日(日)　18：30〜"}]
[]
["２．場所",{"$f":"要項!H50","v":"TOSテレビ大分　大会議室"}]
[]
["３．参加チーム",null,24,"チーム"]
[]
["Aブロック（フリー）",null,null,null,null,null,null,"Bブロック（奇数）"]
["地　　区","チーム名","申込","参加料","出欠",null,null,"地　　区","チーム名","申込","参加料","出欠"]
["大分","ブルーウイングフットボールクラブ","○","○",null,null,null,"中津","鶴居ＳＳＳ","○","○"]
[null,"カティオーラフットボールクラブ　高城","○","○",null,null,null,null,"中津沖代ＪＳＣ","○","○"]
[null,"大道サッカースポーツ少年団","○","○",null,null,null,"速杵国東","ＦＣ安岐","○","○"]
[null,"ＭＳＳ","○","○",null,null,null,null,"八坂少年サッカークラブ","○","○"]
[null,"ドリームキッズサッカークラブ","○","○",null,null,null,"日田","太陽スポーツクラブ大分西","○","○"]
[null,"大分トリニータＵ－１２","○","○",null,null,null,null,"玖珠サッカースポーツ少年団","○","○"]
[null,"ＫＩＮＧＳ　ＦＯＯＴＢＡＬＬＣＬＵＢ　Ｕ－１２","○","○",null,null,null,"別府","大平山アソシエーション式フットボールクラブ","○","○"]
[null,"ＫＩＮＧＳ　ＦＯＯＴＢＡＬＬＣＬＵＢ　Ｕ－１２　Ｂ","○","○",null,null,null,null,"スマイス・セレソン","○","○"]
[null,"由布川サッカースポーツ少年団","○","○",null,null,null,"宇佐高田","ＦＣ　ＷＡＹＳ","○","○"]
[null,"ＦＣ　ＲＥＧＡＴＥ","○","○",null,null,null,"佐伯","佐伯リベロフットボールクラブ","○","○"]
[null,"宗方サッカークラブ","○","○",null,null,null,"豊肥","竹田直入ＦＣ","○","○"]
[null,null,null,null,null,null,null,"臼杵","臼杵ＳＳＳ","○","○"]
[null,null,null,null,null,null,null,"津久見","津久見サッカースポーツ少年団","○","○"]
[]
["４．会議次第"]
["　①ジュニア委員長あいさつ"]
["　②審判部より"]
["　　・大会１日目（予選リーグ）は、帯同審判員を（３級以上）チームで帯同する。"]
["　　　※出場チームにて責任を持って準備する事。"]
["　③要項の確認、質問、諸注意"]
["　④抽選"]
[]
["５．その他"]
["　　①選手証/指導者資格証/審判資格証を、持参のこと。"]
["　　②領収証は、｢振込みの際の領収証」にかえさせていただきます。"]
["　　③大会期間中は、「駐車証」を」車内に表示すること。"]
[]
["６．試合会場"]
[null,"会場",null,null,null,"住所",null,null,null,"電話番号"]
["A　/　B","大分ｽﾎﾟｰﾂ公園だいぎんｻｯｶｰ･ﾗｸﾞﾋﾞｰ場",null,null,null,"大分市大字松岡6841番地",null,null,null,"097-528-7700\n(管理事務所)"]

{"sheet":"要項","index":1,"n_rows":102,"n_cols":8,"rows_kept":102,"cut":false,"hidden":false,"merged":[[0,0,0,14],[5,2,5,14]]}
["OFA　第30回 大分県ジュニアサッカー選手権大会　大会要項(案)"]
[1,"名　称","OFA 第 30 回 大分県ジュニアサッカー選手権大会"]
[2,"主　催","一般社団法人　大分県サッカー協会"]
[3,"主　管","一般社団法人　大分県サッカー協会ジュニア委員会"]
[4,"後　援","大分県教育委員会、大分県体育協会、TOSテレビ大分  大分合同新聞社(依頼中)"]
[5,"特別協賛","『対話式進学塾1対1ネッツ』"]
[6,"協賛","㈱モルテン"]
[7,"日　程","2018年(平成30年)12月1日(土)～2日(日)＊監督会議：1日(土)9:00より"]
[8,"会　場","大分県大分スポーツ公園　だいぎんサッカー・ラグビー場　"]
[null,null,"住所：大分市大字松岡6841　　電話番号：097-528-7700"]
[9,"参加資格","①日本サッカー協会第Ⅳ種に加盟登録したチームであること。"]
[null,null,"②各地区の代表チームであること。"]
[null,null,"③上記チームに所属し、2007年(平成19年)4月2日以降に出生(5年生以下)した選手で構成されたチームであること。"]
[null,null,"④日本協会発行の登録選手証を有し当日持っている者で、選手8名以上16名以内とする。"]
[null,null," 　協会登録チームからは1チームのみ出場できる。但し、5年生が16名以上いる場合、"]
[null,null," 　2チームの出場を認めるが、地区予選時及び上位大会でのメンバーの入れ替えはできない。"]
[null,null," 　その際、それぞれのチームに別々の指導者が帯同すること。同じ指導者が"]
[null,null,"　 チームにまたがって登録することはできない。審判員の扱いも同様である。"]
[null,null,"⑤大分県サッカー協会に2チーム以上加盟登録している同母体のチームについては、2重登録を禁止する。"]
[null,null,"　 また、地区大会と県大会においては、違うチームでの出場はできない。"]
[null,null,"　 加えて、年間を通じて同じチームで活動するチームであることとする。"]
[null,null,"　 他のチームで予選大会に出場またはエントリーされた移籍選手の出場は認めない。"]
[null,null,"　 移籍選手含め、9月末日までに選手登録手続きが完了し、WEBエントリー申請ができることとする。"]
[null,null,"⑥健康であり、且つ保護者の同意を得た選手。"]
[null,null,"⑦傷害保険(スポーツ安全傷害保険)に加入しているチーム及び選手であり、大会中におけるケガや、"]
[null,null," 　賠償金の発生する損害については、当事者で解決すること。"]
[null,null,"⑧指導者は、当該チームを把握指導する責任ある指導者5名以内で、内1名はJFA公認指導者ライセンスを有する事。"]
[null,null,"⑨選手及び指導者、帯同審判員の最終変更は、上記に該当する者とし、11月22日(木)21:00までとする。"]
[null,null,"　 ただし、最終変更後に怪我や流行性の疾患などによるやむを得ない理由がある場合は、県事務局にて協議の上、"]
[null,null,"　 認めることもあり、監督会議までに試合数分　各チームでメンバー表を準備すること。"]
[null,null,"⑩大会1日目(予選リーグ)には、3級以上の帯同審判員を必ず有すること。"]
[null,null,"⑪大会運営に協力でき、マナーを守るチーム(保護者も含む)であること。"]
[10,"出場枠","各地区からの代表24チームとする。"]
[null,null,"ただし、24チームに満たない場合は、比例割の小数ポイントが高い順に推薦する。"]
[11,"大会申込","①11月15日(木)15:00までに、大会参加費(10,000円)の振り込みを済ませること。"]
[null,null,null,"《振込先》　大分銀行　南支店　普通　7500897","大分銀行　　南支店　　普通　　7500897"]
[null,null,null,"                               　　　　一般社団法人　大分県サッカー協会　代表理事　首藤隆憲","一般社団法人　　大分県サッカー協会　　"]
[null,null,"②11月1日(月)～11月15日(木)21:00までに、KICK OFF(JFA ID)の大会(大会への参加申込)より申込願います。"]
[null,null,null,"【大会エントリーガイド】を必ず確認し、対応をお願いします。"]
[null,null,null,"※ベンチスタッフは、大会申込のスタッフ情報に申請した5名のうち3名以内とし、内1名はJFA公認指導者ライセンス\nを有する事。\n"]
[null,null,null,"※帯同審判一覧及びその他スタッフ一覧の【帯同審判】は使用しない事。(各チーム責任を持って準備しておく事)。"]
[null,null,null,"※申請受理されているか確認の事。【大会エントリーガイド参照】"]
[null,null,null,null,"修正及び変更手続きについては、WEBエントリーの問い合わせ先まで連絡の事。"]
[null,null,null,"※プログラム作成の関係でできるだけ早めの提出をお願いします。※これ以降の変更は大会プログラムに反映されません。"]
[null,null,null,"選手及び指導者の変更は開幕10日前まで［11月22日(木)21:00申込完了］とする。"]
[null,null,null,"　　ただし、大会プログラムの掲載は、変更できないことをご了承ください。"]
[null,null,"③連絡先　　　一般社団法人　大分県サッカー協会ジュニア委員会　委員長　安東幹雄"]
[null,null,null," 自宅(Fax)：097-597-1834   携帯：090-8668-0697"]
[]
[12,"抽選方法","11月25日(日)　18：30〜",null,null,null,null,"TOSテレビ大分　大会議室"]
[null,null,"※必ず指導者が出席すること。"]
[13,"競技規則","本大会競技規則は、2017/2018(公財)日本サッカー協会競技規則及び8人制サッカー競技規則に基づく。"]
[null,null,"但し、以下の項目については、特に本大会用として大会規定を定める。"]
[null,null,"①ユニホームは、今大会で認定している正・副すべて異色のものを用意し、いずれも背番号は選手本人と一致すること。"]
[null,null,"　 又、番号は通し番号が望ましい。シャツについては、胸番号/背番号必須で一致してる事とする。"]
[null,null," ・半袖ユニホームの下にアンダーシャツを着用する場合は、その色が袖の主たる色と同色であること。"]
[null,null," ・広告表示については、ユニホーム規定により承認された場合のみ認める。"]
[null,null," ・JFA規約 ユニホームの既定 第5条(7)その他2に明記されているとおり、「チームは、各国代表チーム及び"]
[null,null,"　プロクラブチームのレプリカを着用して公式競技会に出場することはできない」こととする。"]
[null,null,"②ユニフォームの調整は、1日目は9:00からの監督会議の際に、2日目は試合開始"]
[null,null,"　 30分前にするので、監督はFP用2種類、GK用2種類を持参すること。"]
[null,null,"③本大会期間中、警告を2回受けた選手は次の1試合に出場できない。"]
[null,null,"④本大会に於いて退場を命じられた選手は、次の1試合に出場できず、それ以降の処置については"]
[null,null,"　 本大会の規律・フェアプレー委員会で決定する。"]
[null,null,"⑤グリーンカードを導入する。"]
[null,null,"⑥競技者は8人(内1人はGK)とし、6人未満となった場合0-5の負けとする。"]
[null,null,"⑦8人制のルールに則り、キックオフゴールは認められない。"]
[null,null,"⑧ベンチスタッフは、大会申込のスタッフ情報に申請した5名のうち3名以内とし、内1名はJFA公認指導者ライセンス\nを有する事。"]
[null,null,"⑨登録選手以外の選手のベンチ入りは認められない。"]
[null,null,"⑩登録できる交代要員および交代の最大人数は8名とし、交代して退いた競技者は交代要員となり、"]
[null,null,"　 再び出場することができる。交代の回数は制限されない。"]
[null,null,"　 交代は、第4審を通し交代ゾーンから行う。GKが交代する場合は、アウトオブプレー時に主審の許可を得て行う。"]
[14,"競技時間","15分ハーフの計30分とし、ハーフタイムのインターバルは5分とする。"]
[15,"選手交替","13.競技規則　⑩に準ずる。"]
[16,"競技方法","①予選リーグにおいては、参加24チームを3チーム毎の8パートに分けて総当たりによるリーグ戦を行う。"]
[null,null,"②予選リーグにおける順位は、勝ち点(勝3、引分1、負0)・当該対戦・得失点・総得点・抽選の順で決定する。"]
[null,null,"③予選リーグの各パート上位1チームにより、2日目に決勝トーナメントを行い、優勝チームを決定する。"]
[null,null,"④決勝トーナメントで同点の場合、3人制のPK方式にて次回戦進出チームを決定する。"]
[null,null,"　 次回戦進出チームを決定するPK方式においてFPをGKとする場合、その選手と同番号のGKユニホームのシャツを"]
[null,null,"　 着用させる。その場合、交代したGKはFPとなるので同番号のFPユニホームのシャツを着用させること。"]
[null,null,"⑤準決勝戦以降同点の場合は、6分間の延長(3分ハーフ)を行い、なお決しない場合は3人制のPK方式にて勝敗を決定する。"]
[17,"審判","審判は3級以上の有資格者3人に予備審1名を加え、4人制とする。"]
[18,"ボ ー ル","少年用4号球を本部で準備する。"]
[19,"競技場","①コート",null,"縦68m×横50m"]
[null,null,"②センターサークル",null,"半径7m"]
[null,null,"③ゴールエリア",null,"ゴールポスト外側へ4m、その地点からゴールラインに直角に4m"]
[null,null,"④ペナルティエリア",null,"ゴールポスト外側へ12m、その地点からゴールラインに直角に12m"]
[null,null,"⑤ペナルティマーク",null,"8m"]
[null,null,"⑥ゴール",null,"少年用ゴール・高さ2.15m、幅5m"]
[20,"その他","①異議：ベンチ(監督、コーチ、スタッフ等)が審判の判定に対して異議を唱えたり、選手に対し罵声を浴びせる等の"]
[null,null,"　 ネガティブなコーチングを行ったりして、主審から一度注意を受けた後に再度同様な行為があった場合は、主審の"]
[null,null,"　 判断により退席処分とし、それ以降はベンチからのコーチングを不可とする。"]
[null,null,"②監督会議：12月1日(土)9:00よりAコート本部テント前にて行う。"]
[null,null,"③閉会式：試合終了後直ちに行う。"]
[null,null,"④大会上位2チーム(大会運営に協力のできるチームでもあること)は3月23日(土)・24日(日)に佐賀県で"]
[null,null,"　 開催予定の「全国小学生8人制サッカー大会兼九州ジュニア(U-11)サッカー大会　ｉｎ　佐賀」に県代表として推薦する。"]
[null,null,"　 不足及び欠員が生じた場合は、順に補充する。"]
[null,null,"⑤会場設営(大分地区チームのみ)を8時より行います。"]
[null,null,"　大会終了後、ゴールの片付け(大分地区以外の)を行います。ご協力をお願いします。"]
[null,null,"⑥練習は、1試合前のチームのみ、前半及びハーフタイムに所定の場所で可。"]
[null,null,"⑦大会期間中は、常に選手証、指導者資格証、審判資格証もしくは、それぞれの電子証の写しを携帯し、"]
[null,null,"　必要に応じて提示すること。"]

{"sheet":"組合せ抽選用","index":2,"n_rows":45,"n_cols":22,"rows_kept":45,"cut":false,"hidden":false,"merged":[[1,1,1,11],[1,12,1,14],[16,12,17,13],[8,5,9,6],[6,4,7,4],[4,4,5,4],[4,6,5,6],[16,2,17,3],[16,5,17,6],[13,3,15,3],[5,3,7,3],[12,4,13,4],[8,2,9,3],[14,4,15,4],[16,9,17,10],[3,17,13,17],[13,5,15,5],[4,11,5,11],[4,13,5,13],[5,10,7,10],[5,5,7,5],[33,2,34,3],[33,5,34,6],[5,12,7,12],[8,12,9,13],[13,10,15,10],[13,12,15,12],[8,9,9,10],[6,11,7,11],[21,4,22,4],[29,6,30,6],[25,2,26,3],[25,5,26,6],[30,3,32,3],[30,5,32,5],[31,4,32,4],[31,11,32,11],[29,4,30,4],[25,12,26,13],[12,6,13,6],[12,13,13,13],[22,3,24,3],[22,5,24,5],[21,13,22,13],[23,4,24,4],[14,11,15,11],[12,11,13,11],[21,6,22,6],[29,11,30,11],[25,9,26,10],[22,10,24,10],[23,11,24,11],[21,11,22,11],[19,17,20,17],[21,17,22,17],[23,17,24,17],[33,9,34,10],[30,10,32,10],[29,13,30,13],[33,12,34,13],[30,12,32,12],[22,12,24,12],[25,17,26,17]]}
[]
[null,{"$f":"要項!C2","v":"OFA 第 30 回 大分県ジュニアサッカー選手権大会"},null,null,null,null,null,null,null,null,null,null,"組み合わせ",null,null,null,null,"Aブロック（フリー）"]
[null,null,null,null,null,null,null,null,null,null,null,null,null,null,null,null,null,"地　　区","チーム名"]
[null,null,null,null,"「Aパート」",null,null,null,null,null,null,"「Cパート」",null,null,null,null,"D2","大分","ブルーウイング",null,{"$f":"出場チーム!B11","v":"ブルーウイングフットボールクラブ"},"大分"]
[null,null,null,"A1",{"$f":"IF(ISERROR(VLOOKUP(D5,$Q:$S,3,FALSE))=TRUE,\"\",VLOOKUP(D5,$Q:$S,3,FALSE))","v":"竹田直入"},null,null,null,null,null,"C1",{"$f":"IF(ISERROR(VLOOKUP(K5,$Q:$S,3,FALSE))=TRUE,\"\",VLOOKUP(K5,$Q:$S,3,FALSE))","v":"MSS"},null,null,null,null,"H2",null,"カティ高城",null,{"$f":"出場チーム!B12","v":"カティオーラフットボールクラブ　高城"},"大分"]
[null,null,null,null,null,null,null,null,null,null,null,null,null,null,null,null,"A2",null,"大道",null,{"$f":"出場チーム!B13","v":"大道サッカースポーツ少年団"},"大分"]
[null,null,null,null,null,null,null,null,null,null,null,null,null,null,null,null,"C1",null,"MSS",null,{"$f":"出場チーム!B14","v":"ＭＳＳ"},"大分"]
[null,null,null,null,null,null,null,null,null,null,null,null,null,null,null,null,"G2",null,"ドリームキッズ",null,{"$f":"出場チーム!B15","v":"ドリームキッズサッカークラブ"},"大分"]
[null,"A2",{"$f":"IF(ISERROR(VLOOKUP(B9,$Q:$S,3,FALSE))=TRUE,\"\",VLOOKUP(B9,$Q:$S,3,FALSE))","v":"大道"},null,null,{"$f":"IF(ISERROR(VLOOKUP(H9,$Q:$S,3,FALSE))=TRUE,\"\",VLOOKUP(H9,$Q:$S,3,FALSE))","v":"臼杵"},null,"A3","C2",{"$f":"IF(ISERROR(VLOOKUP(I9,$Q:$S,3,FALSE))=TRUE,\"\",VLOOKUP(I9,$Q:$S,3,FALSE))","v":"由布川"},null,null,{"$f":"IF(ISERROR(VLOOKUP(O9,$Q:$S,3,FALSE))=TRUE,\"\",VLOOKUP(O9,$Q:$S,3,FALSE))","v":"鶴居"},null,"C3",null,"D1",null,"トリニータ",null,{"$f":"出場チーム!B16","v":"大分トリニータＵ－１２"},"大分"]
[null,null,null,null,null,null,null,null,null,null,null,null,null,null,null,null,"H1",null,"KINGS",null,{"$f":"出場チーム!B17","v":"ＫＩＮＧＳ　ＦＯＯＴＢＡＬＬＣＬＵＢ　Ｕ－１２"},"大分"]
[null,null,null,null,null,null,null,null,null,null,null,null,null,null,null,null,"E2",null,"KINGS B",null,{"$f":"出場チーム!B18","v":"ＫＩＮＧＳ　ＦＯＯＴＢＡＬＬＣＬＵＢ　Ｕ－１２　Ｂ"},"大分"]
[null,null,null,null,"「Eパート」",null,null,null,null,null,null,"「Gパート」",null,null,null,null,"C2",null,"由布川",null,{"$f":"出場チーム!B19","v":"由布川サッカースポーツ少年団"},"大分"]
[null,null,null,"E1",{"$f":"IF(ISERROR(VLOOKUP(D13,$Q:$S,3,FALSE))=TRUE,\"\",VLOOKUP(D13,$Q:$S,3,FALSE))","v":"中津沖代"},null,null,null,null,null,"G1",{"$f":"IF(ISERROR(VLOOKUP(K13,$Q:$S,3,FALSE))=TRUE,\"\",VLOOKUP(K13,$Q:$S,3,FALSE))","v":"玖珠"},null,null,null,null,"F2",null,"REGATE",null,{"$f":"出場チーム!B20","v":"ＦＣ　ＲＥＧＡＴＥ"},"大分"]
[null,null,null,null,null,null,null,null,null,null,null,null,null,null,null,null,"B2",null,"宗方",null,{"$f":"出場チーム!B21","v":"宗方サッカークラブ"},"大分"]
[]
[]
[null,"E2",{"$f":"IF(ISERROR(VLOOKUP(B17,$Q:$S,3,FALSE))=TRUE,\"\",VLOOKUP(B17,$Q:$S,3,FALSE))","v":"KINGS B"},null,null,{"$f":"IF(ISERROR(VLOOKUP(H17,$Q:$S,3,FALSE))=TRUE,\"\",VLOOKUP(H17,$Q:$S,3,FALSE))","v":"津久見"},null,"E3","G2",{"$f":"IF(ISERROR(VLOOKUP(I17,$Q:$S,3,FALSE))=TRUE,\"\",VLOOKUP(I17,$Q:$S,3,FALSE))","v":"ドリームキッズ"},null,null,{"$f":"IF(ISERROR(VLOOKUP(O17,$Q:$S,3,FALSE))=TRUE,\"\",VLOOKUP(O17,$Q:$S,3,FALSE))","v":"大平山"},null,"G3"]
[null,null,null,null,null,null,null,null,null,null,null,null,null,null,null,null,null,"Bブロック（奇数）"]
[null,null,null,null,null,null,null,null,null,null,null,null,null,null,null,null,null,"地　　区","チーム名"]
[null,null,null,null,null,null,null,null,null,null,null,null,null,null,null,null,"C3","中津","鶴居",null,{"$f":"出場チーム!I11","v":"鶴居ＳＳＳ"},"中津"]
[null,null,null,null,"「Bパート」",null,null,null,null,null,null,"「Dパート」",null,null,null,null,"E1",null,"中津沖代",null,{"$f":"出場チーム!I12","v":"中津沖代ＪＳＣ"},"中津"]
[null,null,null,"B1",{"$f":"IF(ISERROR(VLOOKUP(D22,$Q:$S,3,FALSE))=TRUE,\"\",VLOOKUP(D22,$Q:$S,3,FALSE))","v":"八坂"},null,null,null,null,null,"D1",{"$f":"IF(ISERROR(VLOOKUP(K22,$Q:$S,3,FALSE))=TRUE,\"\",VLOOKUP(K22,$Q:$S,3,FALSE))","v":"トリニータ"},null,null,null,null,"H3","速杵国東","安岐",null,{"$f":"出場チーム!I13","v":"ＦＣ安岐"},"速杵国東"]
[null,null,null,null,null,null,null,null,null,null,null,null,null,null,null,null,"B1",null,"八坂",null,{"$f":"出場チーム!I14","v":"八坂少年サッカークラブ"},"速杵国東"]
[null,null,null,null,null,null,null,null,null,null,null,null,null,null,null,null,"B3","日田","太陽大分西",null,{"$f":"出場チーム!I15","v":"太陽スポーツクラブ大分西"},"日田"]
[null,null,null,null,null,null,null,null,null,null,null,null,null,null,null,null,"G1",null,"玖珠",null,{"$f":"出場チーム!I16","v":"玖珠サッカースポーツ少年団"},"日田"]
[null,"B2",{"$f":"IF(ISERROR(VLOOKUP(B26,$Q:$S,3,FALSE))=TRUE,\"\",VLOOKUP(B26,$Q:$S,3,FALSE))","v":"宗方"},null,null,{"$f":"IF(ISERROR(VLOOKUP(H26,$Q:$S,3,FALSE))=TRUE,\"\",VLOOKUP(H26,$Q:$S,3,FALSE))","v":"太陽大分西"},null,"B3","D2",{"$f":"IF(ISERROR(VLOOKUP(I26,$Q:$S,3,FALSE))=TRUE,\"\",VLOOKUP(I26,$Q:$S,3,FALSE))","v":"ブルーウイング"},null,null,{"$f":"IF(ISERROR(VLOOKUP(O26,$Q:$S,3,FALSE))=TRUE,\"\",VLOOKUP(O26,$Q:$S,3,FALSE))","v":"WAYS"},null,"D3",null,"G3","別府","大平山",null,{"$f":"出場チーム!I17","v":"大平山アソシエーション式フットボールクラブ"},"別府"]
[null,null,null,null,null,null,null,null,null,null,null,null,null,null,null,null,"F1",null,"スマイス・セレソン",null,{"$f":"出場チーム!I18","v":"スマイス・セレソン"},"別府"]
[null,null,null,null,null,null,null,null,null,null,null,null,null,null,null,null,"D3","宇佐高田","WAYS",null,{"$f":"出場チーム!I19","v":"ＦＣ　ＷＡＹＳ"},"宇佐高田"]
[null,null,null,null,"「Fパート」",null,null,null,null,null,null,"「Hパート」",null,null,null,null,"F3","佐伯","佐伯リベロ",null,{"$f":"出場チーム!I20","v":"佐伯リベロフットボールクラブ"},"佐伯"]
[null,null,null,"F1",{"$f":"IF(ISERROR(VLOOKUP(D30,$Q:$S,3,FALSE))=TRUE,\"\",VLOOKUP(D30,$Q:$S,3,FALSE))","v":"スマイス・セレソン"},null,null,null,null,null,"H1",{"$f":"IF(ISERROR(VLOOKUP(K30,$Q:$S,3,FALSE))=TRUE,\"\",VLOOKUP(K30,$Q:$S,3,FALSE))","v":"KINGS"},null,null,null,null,"A1","豊肥","竹田直入",null,{"$f":"出場チーム!I21","v":"竹田直入ＦＣ"},"豊肥"]
[null,null,null,null,null,null,null,null,null,null,null,null,null,null,null,null,"A3","臼杵","臼杵",null,{"$f":"出場チーム!I22","v":"臼杵ＳＳＳ"},"臼杵"]
[null,null,null,null,null,null,null,null,null,null,null,null,null,null,null,null,"E3","津久見","津久見",null,{"$f":"出場チーム!I23","v":"津久見サッカースポーツ少年団"},"津久見"]
[]
[null,"F2",{"$f":"IF(ISERROR(VLOOKUP(B34,$Q:$S,3,FALSE))=TRUE,\"\",VLOOKUP(B34,$Q:$S,3,FALSE))","v":"REGATE"},null,null,{"$f":"IF(ISERROR(VLOOKUP(H34,$Q:$S,3,FALSE))=TRUE,\"\",VLOOKUP(H34,$Q:$S,3,FALSE))","v":"佐伯リベロ"},null,"F3","H2",{"$f":"IF(ISERROR(VLOOKUP(I34,$Q:$S,3,FALSE))=TRUE,\"\",VLOOKUP(I34,$Q:$S,3,FALSE))","v":"カティ高城"},null,null,{"$f":"IF(ISERROR(VLOOKUP(O34,$Q:$S,3,FALSE))=TRUE,\"\",VLOOKUP(O34,$Q:$S,3,FALSE))","v":"安岐"},null,"H3"]
[]
[]
[]
[]
[]
[]
[null,null,null,null,null,null,null,null,null,null,null,null,null,null,null,null,null,"＜抽選方法＞"]
[null,null,null,null,null,null,null,null,null,null,null,null,null,null,null,null,null,"Bブロック 9地区の各第1代表が8パートに分かれるように抽選。"]
[null,null,null,null,null,null,null,null,null,null,null,null,null,null,null,null,null,"(まず、大分地区以外が全パートに入る事が前提で、開会式がある場合は、A1を選手宣誓とする。)"]
[null,null,null,null,null,null,null,null,null,null,null,null,null,null,null,null,null,"２チーム出場の地区が、第1代表と決勝戦まで対戦しないように、左右のパートに分かれるように抽選。"]
[null,null,null,null,null,null,null,null,null,null,null,null,null,null,null,null,null,"大分地区は、振込順にて抽選"]

{"sheet":"会場図","index":3,"n_rows":60,"n_cols":39,"rows_kept":60,"cut":false,"hidden":false,"merged":[[0,31,0,38],[0,0,0,30],[4,37,20,38],[10,2,11,2],[10,36,11,36],[14,36,15,36],[20,14,20,15],[2,15,3,23],[27,18,33,19],[24,33,24,37],[1,0,1,38],[4,0,20,1],[14,2,15,2],[22,18,22,20],[35,0,36,12],[23,23,24,32],[24,1,24,5],[27,22,29,27],[25,0,26,16],[25,18,25,21],[26,17,26,21],[23,6,24,15],[23,16,24,22],[27,0,33,16],[35,17,35,21],[36,18,36,21],[30,22,31,23],[32,22,33,27],[36,28,36,33],[34,18,34,19],[37,0,55,1],[37,18,37,21],[45,3,46,3],[49,3,50,3],[56,15,57,23],[42,38,43,38],[45,37,46,37],[45,38,49,38],[49,37,50,37],[51,38,52,38]]}
[{"$f":"要項!C2","v":"OFA 第 30 回 大分県ジュニアサッカー選手権大会"},null,null,null,null,null,null,null,null,null,null,null,null,null,null,null,null,null,null,null,null,null,null,null,null,null,null,null,null,null,null,"会場図"]
["大分県スポーツ公園　サッカーラグビー場"]
[null,null,null,null,null,null,null,null,null,null,null,null,null,null,null,"①芝生・応援席"]
[]
["芝生・応援席",null,null,null,null,null,null,null,"50m",null,null,null,null,null,null,null,null,null,null,null,null,null,null,null,null,null,null,null,null,null,null,null,null,null,null,null,null,"芝生・応援席"]
[]
[]
[]
[]
[]
[null,null,"ベンチ",null,null,null,null,null,null,null,null,null,null,null,null,null,null,null,null,null,null,null,null,null,null,null,null,null,null,null,null,null,null,null,null,null,"ベンチ"]
[]
[null,null,null,null,null,null,null,null,null,null,null,null,null,null,null,"68m"]
[]
[null,null,"ベンチ",null,null,null,null,null,null,null,null,null,null,null,null,null,null,null,null,null,null,null,null,null,null,null,null,null,null,null,null,null,null,null,null,null,"ベンチ"]
[]
[]
[]
[]
[]
[]
[]
[null,null,"↑",null,null,null,null,null,null,null,null,null,null,null,null,null,null,null,"本部ﾃﾝﾄ",null,null,null,null,null,null,null,null,null,null,null,null,null,null,null,null,null,"↑"]
[null,null,"↑",null,null,null,"①応援席(スタンド）",null,null,null,null,null,null,null,null,null,"④管理棟（来賓・役員）",null,null,null,null,null,null,"①応援席(スタンド）",null,null,null,null,null,null,null,null,null,null,null,null,"↑"]
[null,"②応援出入り口",null,null,null,null,null,null,null,null,null,null,null,null,null,null,null,null,null,null,null,null,null,null,null,null,null,null,null,null,null,null,null,"②応援出入り口"]
["⑥車進入禁止",null,null,null,null,null,null,null,null,null,null,null,null,null,null,null,null,null,"③出入口締切"]
[null,null,null,null,null,null,null,null,null,null,null,null,null,null,null,null,null,"（役員のみ）"]
["⑥Ｂ駐車場",null,null,null,null,null,null,null,null,null,null,null,null,null,null,null,null,null,"テント設営可",null,null,null,"倉庫"]
[]
[]
[null,null,null,null,null,null,null,null,null,null,null,null,null,null,null,null,null,null,null,null,null,null,"WC"]
[]
[]
[]
[null,null,null,null,null,null,null,null,null,null,null,null,null,null,"②","出"]
["①芝生・応援席",null,null,null,null,null,null,null,null,null,null,null,null,"←","応","入",null,"（役員のみ）"]
[null,null,null,null,null,null,null,null,null,null,null,null,null,"↓","援","口",null,null,"③出入口締切",null,null,null,null,null,null,null,null,null,"②応援出入り口"]
["芝生・応援席",null,"←","←","←","←","←","←","←","←","←","←","←","←",null,null,null,null,"本部ﾃﾝﾄ",null,null,null,null,null,null,null,null,null,null,null,null,null,"↓","→","→","→","→","→","↓"]
[]
[null,null,null,null,null,null,null,null,null,"50m"]
[]
[]
[]
[]
[]
[null,null,null,"ベンチ",null,null,null,null,null,null,null,null,null,null,null,null,null,null,null,null,null,null,null,null,null,null,null,null,null,null,null,null,null,null,null,null,null,"ベンチ"]
[]
[null,null,null,null,null,null,null,null,null,null,null,null,null,null,null,null,"68m"]
[]
[null,null,null,"ベンチ",null,null,null,null,null,null,null,null,null,null,null,null,null,null,null,null,null,null,null,null,null,null,null,null,null,null,null,null,null,null,null,null,null,"ベンチ"]
[]
[]
[]
[]
[]
[]
[null,null,null,null,null,null,null,null,null,null,null,null,null,null,null,"①芝生・応援席"]
[]
[null,"※チーム用テントの搬入は、②応援出入り口より行うこと。",null,null,null,null,null,null,null,null,null,null,null,null,null,null,null,null,null,null,null,null,"※喫煙は、本部テント裏の吸い殻入れ付近のみとする。"]
[null,"※チーム用横断幕は、ネットへの取り付け不可。",null,null,null,null,null,null,null,null,null,null,null,null,null,null,null,null,null,null,null,null,null,"Ａ管理棟裏を含む。"]

{"sheet":"MCM資料","index":4,"n_rows":109,"n_cols":36,"rows_kept":109,"cut":false,"hidden":false,"merged":[[96,2,98,38],[56,2,58,38],[68,5,69,38],[71,2,72,38],[74,2,74,38],[75,2,76,38],[59,1,59,2],[62,5,62,32],[63,5,63,32],[64,9,64,14],[67,9,67,14],[70,1,70,2],[73,1,73,2],[77,2,77,38],[84,1,84,2],[89,20,89,24],[0,0,0,38],[1,0,3,38],[7,18,7,20],[9,0,9,38],[12,6,12,32],[5,14,5,21],[5,22,5,24],[7,3,7,11],[7,13,7,15],[7,16,7,17],[7,21,7,29],[7,31,7,33],[18,35,18,36],[7,34,7,35],[10,0,10,34],[13,1,13,3],[13,5,13,33],[14,1,14,3],[14,5,14,33],[17,1,17,2],[17,27,17,34],[17,35,17,36],[18,1,18,2],[18,3,18,11],[18,27,18,34],[19,1,19,2],[19,3,19,11],[19,27,19,34],[19,35,19,36],[20,1,20,2],[20,27,20,34],[20,35,20,36],[21,27,21,34],[21,35,21,36],[22,27,22,34],[22,35,22,36],[23,27,23,34],[23,35,23,36],[30,2,30,9],[24,1,24,2],[24,27,24,34],[24,35,24,36],[25,1,25,2],[25,27,25,34],[25,35,25,36],[26,1,26,2],[27,18,27,24],[28,1,28,2],[28,11,28,33],[29,2,29,9],[31,1,31,2],[33,1,33,2],[35,1,35,2],[42,2,42,34],[44,1,44,2],[49,1,49,2],[55,1,55,2],[36,2,37,38],[38,2,41,38],[50,1,54,38],[45,1,48,38],[78,2,79,38],[80,2,81,38],[82,2,83,38],[93,2,94,38],[108,1,109,33],[100,1,100,2],[101,9,101,18],[103,4,103,12],[103,14,103,19],[103,21,103,29],[105,14,105,19],[89,27,89,31],[90,1,90,2],[90,7,90,15],[91,7,91,15],[92,1,92,2]]}
["マッチコーディネーションミーティング"]
[{"$f":"要項!C2","v":"OFA 第 30 回 大分県ジュニアサッカー選手権大会"}]
[]
[]
[]
[null,null,null,null,null,null,null,null,null,null,null,null,null,null,"マッチナンバー："]
[]
[null,null,null,"組み合わせ左側チーム",null,null,null,null,null,null,null,null,"（",null,null,null,"市）",null,"ｖｓ",null,null,"組み合わせ右側チーム",null,null,null,null,null,null,null,null,"（",null,null,null,"市）"]
[]
["　予選リーグ会場：大分スポーツ公園だいぎんサッカー・ラグビー場 A / B【北】【南】"]
["　決勝トーナメント会場：大分スポーツ公園だいぎんサッカー・ラグビー場 A【北】【南】"]
[]
[null,null,null,null,null,null,"平成３０年（２０１８年）１２月１日（土）・１２月２日(日）"]
[null,"予選L",null,null,null,"①10:00　②10：40　③11：20　④12:00　⑤13:20　⑥14:00"]
[null,"決勝T",null,null,null,"①  9:30　②10:10　③10:50　④11:30　⑤13:30"]
[]
[1," 挨拶および出席者の確認",null,null,null,null,null,null,null,null,null,null,"主管協会（　一般社団法人　大分県サッカー協会　）"]
[null,"a)",null,"マッチコミッショナー・・・・・・・・・・・",null,null,null,null,null,null,null,null,null,null,null,null,null,null,null,null,null,null,null,null,null,null,null,null,null,null,null,null,null,null,null,"氏"]
[null,"b)",null,"組み合わせ左側チーム",null,null,null,null,null,null,null,null,"・・・・・・・・・・・・・・・・・",null,null,null,null,null,null,null,null,null,null,null,null,null,null,null,null,null,null,null,null,null,null,"氏"]
[null,"c)",null,"組み合わせ右側チーム",null,null,null,null,null,null,null,null,"・・・・・・・・・・・・・・・・・",null,null,null,null,null,null,null,null,null,null,null,null,null,null,null,null,null,null,null,null,null,null,"氏"]
[null,"d)",null,"審判団",null,null,null,"主審・・・・・・・・・・・・・・",null,null,null,null,null,null,null,null,null,null,null,null,null,null,null,null,null,null,null,null,null,null,null,null,null,null,null,"氏"]
[null,null,null,null,null,null,null,"副審１・・・・・・・・・・・・・・",null,null,null,null,null,null,null,null,null,null,null,null,null,null,null,null,null,null,null,null,null,null,null,null,null,null,null,"氏"]
[null,null,null,null,null,null,null,"副審２・・・・・・・・・・・・・・・",null,null,null,null,null,null,null,null,null,null,null,null,null,null,null,null,null,null,null,null,null,null,null,null,null,null,null,"氏"]
[null,null,null,null,null,null,null,"第4の審判員・・・・・・・・・・・・",null,null,null,null,null,null,null,null,null,null,null,null,null,null,null,null,null,null,null,null,null,null,null,null,null,null,null,"氏"]
[null,"e)",null,"主管サッカー協会(司会進行）・・・・・・・・・・・・・・",null,null,null,null,null,null,null,null,null,null,null,null,null,null,null,null,null,null,null,null,null,null,null,null,null,null,null,null,null,null,null,"氏"]
[null,"f)",null,"ウェルフェアオフィサー",null,null,null,null,null,null,null,null,null,null,null,null,null,null,null,null,null,null,null,null,null,null,null,null,null,null,null,null,null,null,null,"氏"]
[]
[2,"競技関連事項",null,null,null,null,null,null,null,"マッチコミッショナー",null,null,null,null,null,null,null,"（",null,null,null,null,null,null,null,"）"]
[null,"（1）",null,"累積警告選手の確認",null,null,null,null,null,null,null,"（本大会要項　（10）試合方法 ⑪）"]
[null,null,{"$f":"+D19","v":"組み合わせ左側チーム"}]
[null,null,{"$f":"+D20","v":"組み合わせ右側チーム"}]
[null,"（2）",null,"ユニフォームの色の決定"]
[]
[null,"（3）",null,"試合登録メンバー（選手および役員）の確認"]
[]
[null,"（４）",null,"試合時間"]
[null,"○","予選リーグは３０分とし、ハーフタイムのインターバル（前半終了から後半開始まで）は原則として５分とする。規定の競技時間内に勝敗の決しない場合は、引き分けとする。"]
[]
[null,"○","決勝トーナメントは３０分とし、ハーフタイムのインターバル（前半終了から後半開始まで）は原則として５分とする。規定の競技時間内に勝敗の決しない場合、3人制のPK方式にて勝敗を決定する。但し、準決勝以降は６分の延長戦を行い、それでも勝敗が決しない場合３人制のPK戦を行う。\n＊インターバル＝延長戦に入る前：3分、ペナルティーキック方式に入る前：1分"]
[]
[]
[]
[null,"○","飲水タイムをとる場合は、「その他の理由」により空費された時間として追加する。"]
[null,"○","アディッショナルタイムの標記:",null,null,null,null,null,null,null,null,null,null,null,"行う（表示用ボード）"]
[null,"（5）",null,"競技者の数"]
[null,"○ 試合開始時の人数は、8対8を原則とする。\n○ 競技中、怪我人が出た場合は、交代要員から補充すること。\n○ 退場者が出た場合は、交代要員から補充し、退場者のベンチ戻入は認めない。\n○ 競技者の数がアンバランスになるのは、該当チームに交代要員がいなくなった時に限る。"]
[]
[]
[]
[null,"（6）",null,"選手の交代"]
[null,"○ 競技開始前に登録した最大8名の交代要員の中から、自由な交代が認められ、交代して退いた競技者は交代要員となり、\n　 再び出場することができる。（交代の回数は制限されない。）\n○ 交代は、ボールがインプレー中、アウトオブプレー中にかかわらず行うことができ、チームの指導者、もしくは選手は「第4審」に\n 　交代選手の番号を口頭で報告し、用具チェックを受けた後、交代ゾーンから行う。ただし、交代で退く競技者が負傷している場合\n 　は、主審の承認を得た上でどこからフィールドを離れてもよい。また、ＧＫが交代する場合はアウトプレー時に主審を通じ行う。"]
[]
[]
[]
[]
[null,"（7）",null,"チームベンチへの人数"]
[null,null,"ベンチに入る指導者・選手は、あらかじめ明記した監督1名及びその他役職者２名の計３名（うち1名はJFA公認指導者ライセンスを有すること。）・交代要員となる選手８名を最大とする。\n※大会登録書（メンバー表）に記載された選手及び監督・役員以外のベンチ入りは認めない。"]
[]
[]
[null,"（8）",null,"ウォーミングアップ"]
[null,"***試合前***"]
[null,"○","場所：",null,null,"各会場の指定された区域にて"]
[null,"○","時間：",null,null,"ピッチ外：指定された区域にて"]
[null,null,null,null,null,"ピッチ内：ゴール使用　前の試合のハーフタイムのみ"]
[null,"○","ボール使用の可否：",null,null,null,null,null,null,"可"]
[null,"***試合中***"]
[null,"○","場所：",null,null,"ベンチ横"]
[null,"○","ボール使用の可否：",null,null,null,null,null,null,"否"]
[null,"○","着衣：",null,null,"交代要員の選手は、両チームのユニフォームおよび審判のユニフォームと明確に異なる色の着衣（ビブス等）を身につけること。"]
[]
[null,"（9）",null,"テクニカルエリア"]
[null,null,"戦術的指示を与える際は、その都度ただ1名の役員(監督に限定されない)のみが、テクニカルエリア(ベンチの両端から１メ－トルとタッチラインから1メ－トル)内で行うこと。"]
[]
[null,"（10）",null,"選手のけがの治療"]
[null,"○","レフェリ－が認める特別な場合でないかぎり、フィ－ルド内での医療処置は一切認められない。"]
[null,"○","ケガをした選手が運び出されたり、主審の許可によりフィ－ルドを出ることが認められる場合、医療担当者は医療処置をフィ－ルドの外で行う。"]
[]
[null,"○","主審の指示を受けた場合にのみ、2名以内のチ－ム役員と担架がフィ－ルドに入ることができる。"]
[null,"○","ゴ－ルキ－パ－がケガをした場合は試合を中断し、フィ－ルド内で手当てを受けることが許される。手当てが終わってから試合は再開される。"]
[]
[null,"○","負傷により出血した選手は、出血が止まったことを審判が確認し、主審の合図を受けてからフィールドに復帰することができる。"]
[]
[null,"○","負傷した選手が交代ゾーン以外からピッチを離れ、交替する場合は交替ゾーンから交替する選手は入場する。負傷した選手が治療をおえ、再度交替し入場する場合も交替ゾーンから行う。"]
[]
[null,"（11）",null,"選手の品行"]
[null,"○","フェアプレー"]
[null,"○","サッカーのイメージアップ"]
[null,"○","ストッキングを引き上げる"]
[null,"○","シャツをパンツの中に入れる"]
[null,"○","試合開始前および終了後のセレモニー",null,null,null,null,null,null,null,null,null,null,null,null,null,null,null,null,null,{"$f":"+E104","v":"組み合わせ左側チーム"},null,null,null,null,null,null,{"$f":"+V104","v":"組み合わせ右側チーム"}]
[null,"（12）",null,"試合球",null,null,"「","予選L：本部にて準備",null,null,null,null,null,null,null,null,"」"]
[null,null,null,null,null,null,"「","決勝T：本部にて準備",null,null,null,null,null,null,null,null,"」"]
[null,"（13）",null,"選手の用具",null,null,null,null,"用具及びメンバーチェック　　キックオフ10分前　"]
[null,"○","シャツについては、胸番号/背番号必須で一致していることとし、色彩は、審判員が通常着用する\n黒色と明確に判別し得るものでなければならない。"]
[]
[null,"○","すねあてを必ず着用（すねあて留めを使用する場合は、ソックスと同色である事）"]
[null,"○","※ユニホームの下にアンダーシャツを着用する場合は、その色が袖の主たる色と同色であること。\n※アンダーショーツおよびタイツは、ショーツの主たる色、またはショーツの裾の部分と同じ色でなければならない。\n 　同一チームの競技者が着用する場合、同色のものとする。"]
[]
[]
[null,"○","ゴ－ルキ－パ－は、フィ－ルドの状態、天候によっては長いパンツを着用しても良い"]
[null,"（14）",null,"キックオフ前のセレモニー"]
[null,"○","本部に挨拶を行い、",null,null,null,null,null,null,{"$f":"+V104","v":"組み合わせ右側チーム"},null,null,null,null,null,null,null,null,null,"から、主審に握手をしていく。"]
[]
[null,null,null,"《",{"$f":"+D19","v":"組み合わせ左側チーム"},null,null,null,null,null,null,null,null,"》","＜審判団＞",null,null,null,null,null,"《",{"$f":"+D20","v":"組み合わせ右側チーム"},null,null,null,null,null,null,null,null,"》"]
[null,null,null,null,null,null,null,null,null,null,null,null,null,null,"←","←","←","←","←","←"]
[null,null,null,null,null,null,null,null,null,null,null,null,null,null,"本部"]
[]
[3,"その他"]
[null,"本大会要項（20）その他を、役員・保護者等に周知徹底願います。"]

{"sheet":"累積警告・退場","index":5,"n_rows":28,"n_cols":23,"rows_kept":28,"cut":false,"hidden":false,"merged":[[4,1,14,1],[15,1,16,1],[17,1,18,1],[19,1,20,1],[21,1,22,1]]}
["×",null,{"$f":"要項!C2","v":"OFA 第 30 回 大分県ジュニアサッカー選手権大会"},null,null,"累積警告・退場"]
[null,null,{"$f":"要項!C8","v":"2018年(平成30年)12月1日(土)～2日(日)＊監督会議：1日(土)9:00より"}]
[null,null,null,"地区予選",null,null,null,"予選リーグ　（１試合目）",null,null,null,"予選リーグ　（2試合目）",null,null,null,"1回戦",null,null,null,"準決勝"]
["敗戦","地区","チーム名","背番号","氏名","警告/退場","内容","背番号","氏名","警告/退場","内容","背番号","氏名","警告/退場","内容","背番号","氏名","警告/退場","内容","背番号","氏名","警告/退場","内容"]
[null,"大分",{"$f":"出場チーム!B11","v":"ブルーウイングフットボールクラブ"},"-"]
[null,null,{"$f":"出場チーム!B12","v":"カティオーラフットボールクラブ　高城"},"-"]
[null,null,{"$f":"出場チーム!B13","v":"大道サッカースポーツ少年団"},"-"]
[null,null,{"$f":"出場チーム!B14","v":"ＭＳＳ"},"-"]
[null,null,{"$f":"出場チーム!B15","v":"ドリームキッズサッカークラブ"},"-"]
[null,null,{"$f":"出場チーム!B16","v":"大分トリニータＵ－１２"},"-"]
[null,null,{"$f":"出場チーム!B17","v":"ＫＩＮＧＳ　ＦＯＯＴＢＡＬＬＣＬＵＢ　Ｕ－１２"},"-"]
[null,null,{"$f":"出場チーム!B18","v":"ＫＩＮＧＳ　ＦＯＯＴＢＡＬＬＣＬＵＢ　Ｕ－１２　Ｂ"},"-",null,null,null,4,{"$f":"IF(ISERROR(VLOOKUP(CONCATENATE($C$12,\"_\",H12),選手名簿!$A:$E,5,FALSE))=TRUE,\"\",VLOOKUP(CONCATENATE($C$12,\"_\",H12),選手名簿!$A:$E,5,FALSE))","v":"平川　幹大"},"警告","反スポ"]
[null,null,{"$f":"出場チーム!B19","v":"由布川サッカースポーツ少年団"},"-"]
[null,null,{"$f":"出場チーム!B20","v":"ＦＣ　ＲＥＧＡＴＥ"},"-"]
[null,null,{"$f":"出場チーム!B21","v":"宗方サッカークラブ"},"-"]
[null,"中津",{"$f":"出場チーム!I11","v":"鶴居ＳＳＳ"},"-"]
[null,null,{"$f":"出場チーム!I12","v":"中津沖代ＪＳＣ"},"-"]
[null,"速杵国東",{"$f":"出場チーム!I13","v":"ＦＣ安岐"},"-"]
[null,null,{"$f":"出場チーム!I14","v":"八坂少年サッカークラブ"},"-"]
[null,"日田",{"$f":"出場チーム!I15","v":"太陽スポーツクラブ大分西"},"-"]
[null,null,{"$f":"出場チーム!I16","v":"玖珠サッカースポーツ少年団"},"-"]
[null,"別府",{"$f":"出場チーム!I17","v":"大平山アソシエーション式フットボールクラブ"},"-"]
[null,null,{"$f":"出場チーム!I18","v":"スマイス・セレソン"},"-"]
[null,"宇佐高田",{"$f":"出場チーム!I19","v":"ＦＣ　ＷＡＹＳ"},"-"]
[null,"佐伯",{"$f":"出場チーム!I20","v":"佐伯リベロフットボールクラブ"},"-"]
[null,"豊肥",{"$f":"出場チーム!I21","v":"竹田直入ＦＣ"},"-"]
[null,"臼杵",{"$f":"出場チーム!I22","v":"臼杵ＳＳＳ"},"-"]
[null,"津久見",{"$f":"出場チーム!I23","v":"津久見サッカースポーツ少年団"},"-"]

{"sheet":"予選リーグ","index":6,"n_rows":32,"n_cols":14,"rows_kept":32,"cut":false,"hidden":false,"merged":[[1,6,1,7],[24,8,25,8],[22,11,23,11],[20,11,21,11],[22,10,23,10],[22,7,23,7],[24,7,25,7],[13,8,13,13],[14,8,14,10],[30,11,31,11],[30,8,31,8],[20,10,21,10],[30,13,31,13],[28,10,29,10],[24,13,25,13],[24,11,25,11],[20,13,21,13],[22,13,23,13],[28,13,29,13],[30,10,31,10],[24,10,25,10],[28,11,29,11],[26,2,27,13],[28,8,29,8],[30,4,31,4],[28,2,29,2],[30,2,31,2],[28,4,29,4],[30,7,31,7],[28,5,29,5],[30,5,31,5],[28,7,29,7],[28,0,29,0],[30,0,31,0],[28,1,29,1],[30,1,31,1],[26,0,27,0],[26,1,27,1],[24,1,25,1],[24,0,25,0],[16,8,16,10],[18,8,19,8],[20,8,21,8],[22,8,23,8],[18,10,19,10],[18,0,19,0],[22,5,23,5],[20,4,21,4],[20,0,21,0],[22,0,23,0],[0,1,0,4],[24,2,25,2],[18,2,19,2],[20,2,21,2],[22,2,23,2],[18,1,19,1],[20,1,21,1],[24,4,25,4],[22,1,23,1],[13,2,13,7],[24,5,25,5],[20,7,21,7],[22,4,23,4],[18,7,19,7],[20,5,21,5],[1,2,1,3],[14,2,14,4],[14,11,14,13],[14,5,14,7],[16,11,16,13],[18,13,19,13],[18,11,19,11],[18,4,19,4],[18,5,19,5],[16,2,16,4],[16,5,16,7]]}
[null,"《予選リーグ日程》",null,null,null,"１２月１日（土）"]
[null,null,"８：００",null,"グラウンド設営",null,"９：００",null,"監督会議"]
[]
[null,null,null,"「Aパート」",null,null,"「Bパート」",null,null,"「Eパート」",null,null,"「Fパート」"]
[null,null,null,{"$f":"組合せ抽選用!E5","v":"竹田直入"},null,null,{"$f":"組合せ抽選用!E22","v":"八坂"},null,null,{"$f":"組合せ抽選用!E13","v":"中津沖代"},null,null,{"$f":"組合せ抽選用!E30","v":"スマイス・セレソン"}]
[]
[null,null,{"$f":"組合せ抽選用!C9","v":"大道"},null,{"$f":"組合せ抽選用!F9","v":"臼杵"},{"$f":"組合せ抽選用!C26","v":"宗方"},null,{"$f":"組合せ抽選用!F26","v":"太陽大分西"},{"$f":"組合せ抽選用!C17","v":"KINGS B"},null,{"$f":"組合せ抽選用!F17","v":"津久見"},{"$f":"組合せ抽選用!C34","v":"REGATE"},null,{"$f":"組合せ抽選用!F34","v":"佐伯リベロ"}]
[]
[null,null,null,"「Cパート」",null,null,"「Dパート」",null,null,"「Gパート」",null,null,"「Hパート」"]
[null,null,null,{"$f":"組合せ抽選用!L5","v":"MSS"},null,null,{"$f":"組合せ抽選用!L22","v":"トリニータ"},null,null,{"$f":"組合せ抽選用!L13","v":"玖珠"},null,null,{"$f":"組合せ抽選用!L30","v":"KINGS"}]
[]
[null,null,{"$f":"組合せ抽選用!J9","v":"由布川"},null,{"$f":"組合せ抽選用!M9","v":"鶴居"},{"$f":"組合せ抽選用!J26","v":"ブルーウイング"},null,{"$f":"組合せ抽選用!M26","v":"WAYS"},{"$f":"組合せ抽選用!J17","v":"ドリームキッズ"},null,{"$f":"組合せ抽選用!M17","v":"大平山"},{"$f":"組合せ抽選用!J34","v":"カティ高城"},null,{"$f":"組合せ抽選用!M34","v":"安岐"}]
[]
[null,null,"サッカー・ラグビーＡコート",null,null,null,null,null,"サッカー・ラグビーBコート"]
[null,"開始時刻","「北」コート",null,null,"「南」コート",null,null,"「北」コート",null,null,"「南」コート"]
[null,"ﾗｲﾝ引","大道","MSS","由布川","宗方","トリニータ","ブルーウイング","KINGS B","ドリームキッズ",null,"REGATE","KINGS","カティ高城"]
[null,"ｺﾞｰﾙ運搬"]
[null,"審判",null,"副審",null,null,"副審",null,null,"副審",null,null,"副審"]
["①","10:00:00",{"$f":"D5","v":"竹田直入"},{"$f":"E12","v":"鶴居"},{"$f":"C7","v":"大道"},{"$f":"G5","v":"八坂"},{"$f":"H12","v":"WAYS"},{"$f":"F7","v":"宗方"},{"$f":"J5","v":"中津沖代"},{"$f":"K12","v":"大平山"},{"$f":"I7","v":"KINGS B"},{"$f":"M5","v":"スマイス・セレソン"},{"$f":"N12","v":"安岐"},{"$f":"L7","v":"REGATE"}]
[null,null,null,{"$f":"D10","v":"MSS"},null,null,{"$f":"G10","v":"トリニータ"},null,null,{"$f":"J10","v":"玖珠"},null,null,{"$f":"M10","v":"KINGS"}]
["②","10:40:00",{"$f":"D10","v":"MSS"},{"$f":"D5","v":"竹田直入"},{"$f":"C12","v":"由布川"},{"$f":"G10","v":"トリニータ"},{"$f":"G5","v":"八坂"},{"$f":"F12","v":"ブルーウイング"},{"$f":"J10","v":"玖珠"},{"$f":"J5","v":"中津沖代"},{"$f":"I12","v":"ドリームキッズ"},{"$f":"M10","v":"KINGS"},{"$f":"M5","v":"スマイス・セレソン"},{"$f":"L12","v":"カティ高城"}]
[null,null,null,{"$f":"C7","v":"大道"},null,null,{"$f":"F7","v":"宗方"},null,null,{"$f":"I7","v":"KINGS B"},null,null,{"$f":"L7","v":"REGATE"}]
["③","11:20:00",{"$f":"C7","v":"大道"},{"$f":"D10","v":"MSS"},{"$f":"E7","v":"臼杵"},{"$f":"F7","v":"宗方"},{"$f":"G10","v":"トリニータ"},{"$f":"H7","v":"太陽大分西"},{"$f":"I7","v":"KINGS B"},{"$f":"J10","v":"玖珠"},{"$f":"K7","v":"津久見"},{"$f":"L7","v":"REGATE"},{"$f":"M10","v":"KINGS"},{"$f":"N7","v":"佐伯リベロ"}]
[null,null,null,{"$f":"C12","v":"由布川"},null,null,{"$f":"F12","v":"ブルーウイング"},null,null,{"$f":"I12","v":"ドリームキッズ"},null,null,{"$f":"L12","v":"カティ高城"}]
["④","12:00:00",{"$f":"C12","v":"由布川"},{"$f":"C7","v":"大道"},{"$f":"E12","v":"鶴居"},{"$f":"F12","v":"ブルーウイング"},{"$f":"F7","v":"宗方"},{"$f":"H12","v":"WAYS"},{"$f":"I12","v":"ドリームキッズ"},{"$f":"I7","v":"KINGS B"},{"$f":"K12","v":"大平山"},{"$f":"L12","v":"カティ高城"},{"$f":"L7","v":"REGATE"},{"$f":"N12","v":"安岐"}]
[null,null,null,{"$f":"E7","v":"臼杵"},null,null,{"$f":"H7","v":"太陽大分西"},null,null,{"$f":"K7","v":"津久見"},null,null,{"$f":"N7","v":"佐伯リベロ"}]
[null,"12:40:00","休　　　　　　憩"]
[]
["⑤","13:20:00",{"$f":"E7","v":"臼杵"},{"$f":"C12","v":"由布川"},{"$f":"D5","v":"竹田直入"},{"$f":"H7","v":"太陽大分西"},{"$f":"F12","v":"ブルーウイング"},{"$f":"G5","v":"八坂"},{"$f":"K7","v":"津久見"},{"$f":"I12","v":"ドリームキッズ"},{"$f":"J5","v":"中津沖代"},{"$f":"N7","v":"佐伯リベロ"},{"$f":"L12","v":"カティ高城"},{"$f":"M5","v":"スマイス・セレソン"}]
[null,null,null,{"$f":"E12","v":"鶴居"},null,null,{"$f":"H12","v":"WAYS"},null,null,{"$f":"K12","v":"大平山"},null,null,{"$f":"N12","v":"安岐"}]
["⑥","14:00:00",{"$f":"E12","v":"鶴居"},{"$f":"E7","v":"臼杵"},{"$f":"D10","v":"MSS"},{"$f":"H12","v":"WAYS"},{"$f":"H7","v":"太陽大分西"},{"$f":"G10","v":"トリニータ"},{"$f":"K12","v":"大平山"},{"$f":"K7","v":"津久見"},{"$f":"J10","v":"玖珠"},{"$f":"N12","v":"安岐"},{"$f":"N7","v":"佐伯リベロ"},{"$f":"M10","v":"KINGS"}]
[null,null,null,{"$f":"D5","v":"竹田直入"},null,null,{"$f":"G5","v":"八坂"},null,null,{"$f":"J5","v":"中津沖代"},null,null,{"$f":"M5","v":"スマイス・セレソン"}]

{"sheet":"予選リーグ (2)","index":7,"n_rows":77,"n_cols":53,"rows_kept":77,"cut":false,"hidden":false,"merged":[[17,52,17,54],[24,52,24,54],[18,49,18,51],[19,37,19,39],[19,43,19,44],[19,45,19,47],[19,49,19,51],[18,40,18,42],[24,37,24,39],[18,45,18,47],[24,40,24,42],[24,49,24,51],[18,52,18,54],[19,52,19,54],[22,52,22,54],[23,52,23,54],[20,31,21,54],[23,33,23,35],[19,40,19,42],[22,37,22,39],[23,31,23,32],[22,49,22,51],[23,49,23,51],[22,45,22,47],[25,52,25,54],[24,45,24,47],[23,40,23,42],[18,28,19,28],[23,37,23,39],[22,40,22,42],[18,37,18,39],[24,43,24,44],[22,28,23,28],[20,28,21,28],[25,33,25,35],[25,31,25,32],[24,29,25,30],[24,33,24,35],[24,31,24,32],[18,31,18,32],[18,33,18,35],[22,31,22,32],[22,33,22,35],[18,29,19,30],[19,31,19,32],[25,49,25,51],[25,40,25,42],[23,45,23,47],[16,49,16,51],[16,45,16,47],[15,33,15,35],[16,33,16,35],[15,17,15,19],[16,29,17,30],[17,40,17,42],[17,49,17,51],[16,43,16,44],[16,17,16,19],[17,17,17,19],[17,21,17,23],[16,24,16,26],[17,24,17,26],[17,33,17,35],[16,31,16,32],[17,31,17,32],[16,21,16,23],[15,37,15,39],[22,43,22,44],[23,43,23,44],[13,24,13,26],[14,21,14,23],[47,0,48,0],[47,1,47,2],[13,21,13,23],[14,33,14,35],[15,21,15,23],[14,28,15,28],[14,29,15,30],[14,31,14,32],[15,24,15,26],[47,19,48,19],[25,24,25,26],[24,24,24,26],[24,21,24,23],[19,33,19,35],[22,1,23,2],[22,3,22,4],[46,3,46,5],[22,5,22,7],[14,37,14,39],[13,43,13,44],[2,0,2,2],[3,0,3,2],[4,0,6,2],[2,3,2,26],[3,3,3,8],[4,3,4,8],[6,3,6,8],[3,15,3,20],[4,15,4,20],[3,9,3,14],[4,9,4,14],[6,9,6,14],[3,21,3,26],[4,21,4,26],[6,21,6,26],[5,21,5,26],[5,15,5,20],[46,0,46,2],[24,0,25,0],[24,1,25,2],[25,5,25,7],[25,3,25,4],[22,0,23,0],[19,3,19,4],[24,3,24,4],[24,5,24,7],[19,5,19,7],[18,0,19,0],[18,1,19,2],[18,3,18,4],[54,18,54,19],[54,22,54,23],[54,9,54,11],[51,12,52,12],[51,14,52,14],[51,13,52,13],[51,23,52,23],[51,22,52,22],[47,17,48,17],[49,23,50,23],[47,12,48,12],[49,12,50,12],[47,18,48,18],[51,18,52,18],[49,18,50,18],[51,19,52,19],[47,15,48,15],[12,45,12,47],[17,37,17,39],[17,45,17,47],[17,43,17,44],[16,40,16,42],[16,37,16,39],[15,40,15,42],[54,3,54,5],[13,12,13,14],[15,9,15,11],[22,9,22,11],[46,6,46,8],[49,20,50,21],[51,20,52,21],[49,17,50,17],[49,19,50,19],[18,15,18,16],[15,15,15,16],[16,15,16,16],[13,15,13,16],[17,15,17,16],[16,5,16,7],[17,5,17,7],[17,12,17,14],[13,45,13,47],[15,43,15,44],[15,31,15,32],[47,20,48,21],[24,28,25,28],[46,28,46,30],[47,22,48,22],[46,24,46,25],[47,23,48,23],[47,24,48,25],[46,22,46,23],[48,29,48,30],[23,24,23,26],[23,21,23,23],[25,45,25,47],[13,40,13,42],[14,45,14,47],[14,43,14,44],[13,33,13,35],[13,37,13,39],[25,43,25,44],[25,21,25,23],[25,37,25,39],[15,45,15,47],[2,28,2,30],[3,28,3,30],[12,28,13,28],[12,29,13,30],[11,28,11,30],[46,18,46,19],[22,21,22,23],[19,21,19,23],[20,29,21,30],[22,29,23,30],[46,20,46,21],[25,17,25,19],[14,24,14,26],[12,21,12,23],[13,17,13,19],[12,17,12,19],[16,28,17,28],[14,17,14,19],[19,24,19,26],[18,17,18,19],[22,17,22,19],[22,24,22,26],[18,21,18,23],[24,17,24,19],[12,52,12,54],[23,3,23,4],[23,5,23,7],[18,5,18,7],[11,52,11,54],[16,0,17,0],[16,1,17,2],[16,3,16,4],[17,3,17,4],[14,5,14,7],[14,0,15,0],[14,1,15,2],[14,3,14,4],[15,3,15,4],[16,52,16,54],[13,52,13,54],[13,49,13,51],[14,52,14,54],[15,52,15,54],[14,49,14,51],[15,49,15,51],[11,12,11,14],[14,12,14,14],[14,9,14,11],[4,49,4,54],[5,49,5,54],[10,31,10,42],[5,43,5,48],[6,43,6,48],[10,43,10,54],[5,37,5,42],[6,37,6,42],[4,37,4,42],[6,31,6,36],[11,40,11,42],[5,3,5,8],[6,15,6,20],[10,15,10,26],[11,24,11,26],[10,3,10,14],[5,9,5,14],[12,12,12,14],[12,15,12,16],[12,31,12,32],[12,33,12,35],[12,40,12,42],[12,37,12,39],[12,24,12,26],[12,5,12,7],[12,9,12,11],[18,12,18,14],[47,28,48,28],[47,29,47,30],[49,13,50,13],[51,29,51,30],[50,29,50,30],[11,0,11,2],[10,0,10,2],[14,15,14,16],[13,9,13,11],[24,15,24,16],[25,15,25,16],[23,17,23,19],[16,9,16,11],[15,5,15,7],[17,9,17,11],[15,12,15,14],[16,12,16,14],[23,15,23,16],[48,1,48,2],[50,1,50,2],[46,9,46,11],[25,9,25,11],[13,5,13,7],[57,17,58,17],[57,18,58,18],[55,17,56,17],[55,18,56,18],[57,22,58,22],[57,23,58,23],[24,9,24,11],[4,28,6,30],[10,28,10,30],[49,22,50,22],[51,16,52,16],[51,17,52,17],[51,15,52,15],[47,16,48,16],[23,9,23,11],[23,12,23,14],[20,3,21,26],[19,9,19,11],[18,9,18,11],[22,15,22,16],[19,15,19,16],[19,17,19,19],[18,24,18,26],[19,12,19,14],[57,13,58,13],[58,1,58,2],[49,15,50,15],[55,12,56,12],[55,13,56,13],[54,6,54,8],[51,0,52,0],[51,1,51,2],[55,0,56,0],[55,1,55,2],[56,1,56,2],[52,1,52,2],[54,0,54,2],[49,0,50,0],[49,1,49,2],[18,43,18,44],[24,12,24,14],[55,14,56,14],[22,12,22,14],[25,12,25,14],[47,14,48,14],[47,13,48,13],[51,42,52,42],[55,28,56,28],[55,29,55,30],[55,42,56,42],[56,29,56,30],[54,28,54,30],[51,24,52,25],[55,15,56,15],[55,16,56,16],[49,16,50,16],[49,14,50,14],[55,22,56,22],[55,23,56,23],[55,20,56,21],[46,37,46,39],[47,44,48,44],[55,19,56,19],[47,41,48,41],[47,42,48,42],[54,24,54,25],[54,20,54,21],[54,34,54,36],[49,24,50,25],[51,28,52,28],[52,29,52,30],[54,37,54,39],[49,28,50,28],[49,29,49,30],[12,49,12,51],[51,40,52,40],[13,31,13,32],[12,43,12,44],[14,40,14,42],[49,46,50,46],[49,47,50,47],[47,50,48,50],[47,48,48,49],[47,51,48,51],[51,48,52,49],[49,51,50,51],[49,50,50,50],[49,43,50,43],[46,31,46,33],[51,41,52,41],[49,41,50,41],[49,42,50,42],[47,40,48,40],[49,40,50,40],[46,34,46,36],[47,47,48,47],[47,46,48,46],[46,46,46,47],[47,52,48,53],[47,45,48,45],[47,43,48,43],[49,52,50,53],[49,48,50,49],[46,52,46,53],[46,50,46,51],[46,48,46,49],[59,13,60,13],[57,24,58,25],[49,45,50,45],[55,48,56,49],[55,47,56,47],[51,45,52,45],[54,48,54,49],[51,47,52,47],[54,46,54,47],[55,52,56,53],[55,50,56,50],[51,46,52,46],[55,46,56,46],[54,52,54,53],[54,50,54,51],[55,51,56,51],[60,1,60,2],[62,0,62,2],[62,3,62,5],[59,1,59,2],[57,14,58,14],[62,22,62,23],[57,20,58,21],[59,15,60,15],[59,16,60,16],[59,17,60,17],[59,20,60,21],[59,19,60,19],[59,18,60,18],[62,20,62,21],[59,22,60,22],[59,0,60,0],[59,12,60,12],[59,14,60,14],[57,19,58,19],[57,15,58,15],[57,16,58,16],[57,0,58,0],[57,1,57,2],[57,12,58,12],[63,0,64,0],[63,19,64,19],[62,18,62,19],[62,6,62,8],[62,9,62,11],[63,14,64,14],[63,15,64,15],[65,0,66,0],[65,1,65,2],[65,12,66,12],[65,13,66,13],[66,1,66,2],[63,16,64,16],[63,1,63,2],[63,12,64,12],[63,13,64,13],[64,1,64,2],[63,17,64,17],[65,14,66,14],[65,15,66,15],[65,16,66,16],[65,17,66,17],[63,18,64,18],[65,18,66,18],[71,20,72,21],[71,18,72,18],[70,18,70,19],[71,19,72,19],[70,20,70,21],[67,19,68,19],[67,14,68,14],[67,15,68,15],[67,16,68,16],[67,20,68,21],[65,19,66,19],[65,20,66,21],[67,13,68,13],[67,0,68,0],[67,18,68,18],[67,17,68,17],[67,1,67,2],[67,12,68,12],[68,1,68,2],[71,0,72,0],[73,0,74,0],[73,1,73,2],[70,0,70,2],[70,3,70,5],[70,6,70,8],[70,9,70,11],[71,14,72,14],[73,14,74,14],[75,0,76,0],[75,1,75,2],[75,12,76,12],[75,13,76,13],[76,1,76,2],[73,19,74,19],[75,14,76,14],[75,17,76,17],[71,1,71,2],[73,13,74,13],[74,1,74,2],[72,1,72,2],[71,12,72,12],[71,13,72,13],[75,15,76,15],[75,16,76,16],[73,12,74,12],[75,18,76,18],[71,15,72,15],[73,17,74,17],[73,18,74,18],[73,15,74,15],[71,16,72,16],[71,17,72,17],[73,16,74,16],[75,19,76,19],[67,24,68,25],[70,24,70,25],[75,20,76,21],[59,23,60,23],[73,22,74,22],[71,22,72,22],[71,23,72,23],[75,22,76,22],[73,23,74,23],[73,20,74,21],[63,23,64,23],[63,20,64,21],[63,22,64,22],[65,23,66,23],[65,22,66,22],[59,24,60,25],[75,23,76,23],[75,24,76,25],[67,23,68,23],[73,24,74,25],[70,22,70,23],[71,24,72,25],[67,22,68,22],[65,24,66,25],[62,24,62,25],[55,24,56,25],[54,31,54,33],[63,24,64,25],[51,44,52,44],[49,44,50,44],[57,40,58,40],[57,41,58,41],[59,42,60,42],[59,43,60,43],[57,42,58,42],[62,28,62,30],[59,28,60,28],[51,43,52,43],[59,29,59,30],[57,28,58,28],[58,29,58,30],[57,29,57,30],[60,29,60,30],[57,43,58,43],[55,41,56,41],[59,40,60,40],[51,52,52,53],[51,50,52,50],[51,51,52,51],[57,52,58,53],[57,50,58,50],[57,51,58,51],[59,44,60,44],[57,44,58,44],[57,46,58,46],[59,52,60,53],[59,46,60,46],[59,47,60,47],[59,48,60,49],[59,51,60,51],[57,47,58,47],[57,48,58,49],[59,50,60,50],[59,45,60,45],[57,45,58,45],[59,41,60,41],[55,40,56,40],[55,45,56,45],[55,44,56,44],[55,43,56,43],[63,28,64,28],[63,42,64,42],[63,43,64,43],[63,41,64,41],[62,52,62,53],[62,50,62,51],[63,52,64,53],[63,29,63,30],[63,40,64,40],[64,29,64,30],[63,51,64,51],[62,31,62,33],[62,34,62,36],[62,37,62,39],[63,45,64,45],[63,50,64,50],[63,48,64,49],[63,47,64,47],[63,46,64,46],[62,48,62,49],[62,46,62,47],[63,44,64,44],[67,52,68,53],[65,44,66,44],[65,50,66,50],[65,51,66,51],[65,52,66,53],[67,51,68,51],[65,45,66,45],[67,50,68,50],[67,42,68,42],[67,43,68,43],[67,44,68,44],[67,45,68,45],[67,46,68,46],[67,47,68,47],[65,43,66,43],[68,29,68,30],[66,29,66,30],[67,48,68,49],[65,42,66,42],[65,28,66,28],[65,29,65,30],[65,40,66,40],[65,41,66,41],[70,31,70,33],[70,34,70,36],[70,37,70,39],[70,28,70,30],[67,28,68,28],[67,29,67,30],[70,46,70,47],[70,48,70,49],[65,46,66,46],[65,47,66,47],[65,48,66,49],[67,40,68,40],[67,41,68,41],[70,52,70,53],[70,50,70,51],[71,52,72,53],[71,50,72,50],[71,51,72,51],[71,28,72,28],[71,29,71,30],[71,40,72,40],[71,41,72,41],[72,29,72,30],[71,45,72,45],[71,42,72,42],[71,43,72,43],[71,44,72,44],[71,48,72,49],[71,46,72,46],[71,47,72,47],[73,28,74,28],[75,42,76,42],[75,43,76,43],[75,44,76,44],[75,28,76,28],[75,29,75,30],[75,40,76,40],[75,41,76,41],[76,29,76,30],[73,40,74,40],[74,29,74,30],[73,42,74,42],[73,43,74,43],[73,44,74,44],[73,29,73,30],[73,41,74,41],[75,45,76,45],[73,48,74,49],[75,46,76,46],[75,47,76,47],[75,48,76,49],[73,46,74,46],[73,45,74,45],[73,47,74,47],[75,51,76,51],[75,52,76,53],[75,50,76,50],[73,50,74,50],[73,51,74,51],[73,52,74,53],[0,0,0,26],[0,28,0,54],[9,28,9,30],[9,0,9,2],[2,31,2,54],[3,49,3,54],[3,37,3,42],[3,43,3,48],[6,49,6,54],[4,43,4,48],[3,31,3,36],[4,31,4,36],[20,0,21,0],[20,1,21,2],[12,0,13,0],[12,1,13,2],[12,3,12,4],[13,3,13,4],[5,31,5,36]]}
["＜予選リーグ組み合わせ・結果＞",null,null,null,null,null,null,null,null,null,null,null,null,null,null,null,null,null,null,null,null,null,null,null,null,null,null,null,"＜予選リーグ組み合わせ・結果＞"]
[]
["会場",null,null,"サッカー・ラグビー　Ａコート",null,null,null,null,null,null,null,null,null,null,null,null,null,null,null,null,null,null,null,null,null,null,null,null,"会場",null,null,"サッカー・ラグビー　Ｂコート"]
["グループ",null,null,"【　A　】",null,null,null,null,null,"【　C　】",null,null,null,null,null,"【　B　】",null,null,null,null,null,"【　D　】",null,null,null,null,null,null,"グループ",null,null,"【　E　】",null,null,null,null,null,"【　G　】",null,null,null,null,null,"【　F　】",null,null,null,null,null,"【　H　】"]
["チーム",null,null,{"$f":"予選リーグ!D5","v":"竹田直入"},null,null,null,null,null,{"$f":"予選リーグ!D10","v":"MSS"},null,null,null,null,null,{"$f":"予選リーグ!G5","v":"八坂"},null,null,null,null,null,{"$f":"予選リーグ!G10","v":"トリニータ"},null,null,null,null,null,null,"チーム",null,null,{"$f":"予選リーグ!J5","v":"中津沖代"},null,null,null,null,null,{"$f":"予選リーグ!J10","v":"玖珠"},null,null,null,null,null,{"$f":"予選リーグ!M5","v":"スマイス・セレソン"},null,null,null,null,null,{"$f":"予選リーグ!M10","v":"KINGS"}]
[null,null,null,{"$f":"予選リーグ!C7","v":"大道"},null,null,null,null,null,{"$f":"予選リーグ!C12","v":"由布川"},null,null,null,null,null,{"$f":"予選リーグ!F7","v":"宗方"},null,null,null,null,null,{"$f":"予選リーグ!F12","v":"ブルーウイング"},null,null,null,null,null,null,null,null,null,{"$f":"予選リーグ!I7","v":"KINGS B"},null,null,null,null,null,{"$f":"予選リーグ!I12","v":"ドリームキッズ"},null,null,null,null,null,{"$f":"予選リーグ!L7","v":"REGATE"},null,null,null,null,null,{"$f":"予選リーグ!L12","v":"カティ高城"}]
[null,null,null,{"$f":"予選リーグ!E7","v":"臼杵"},null,null,null,null,null,{"$f":"予選リーグ!E12","v":"鶴居"},null,null,null,null,null,{"$f":"予選リーグ!H7","v":"太陽大分西"},null,null,null,null,null,{"$f":"予選リーグ!H12","v":"WAYS"},null,null,null,null,null,null,null,null,null,{"$f":"予選リーグ!K7","v":"津久見"},null,null,null,null,null,{"$f":"予選リーグ!K12","v":"大平山"},null,null,null,null,null,{"$f":"予選リーグ!N7","v":"佐伯リベロ"},null,null,null,null,null,{"$f":"予選リーグ!N12","v":"安岐"}]
[]
[]
["【組合せ・時間割】",null,null,null,null,null,null,null,null,null,null,null,null,null,null,null,null,null,null,null,null,null,null,null,null,null,null,null,"【組合せ・時間割】"]
["コート",null,null,{"$f":"予選リーグ!C15","v":"「北」コート"},null,null,null,null,null,null,null,null,null,null,null,{"$f":"予選リーグ!F15","v":"「南」コート"},null,null,null,null,null,null,null,null,null,null,null,null,"コート",null,null,{"$f":"予選リーグ!I15","v":"「北」コート"},null,null,null,null,null,null,null,null,null,null,null,{"$f":"予選リーグ!L15","v":"「南」コート"}]
["試合時間",null,null,null,null,null,null,null,"対戦相手",null,null,null,"副審",null,null,null,null,null,null,null,"対戦相手",null,null,null,"副審",null,null,null,"試合時間",null,null,null,null,null,null,null,"対戦相手",null,null,null,"副審",null,null,null,null,null,null,null,"対戦相手",null,null,null,"副審"]
["①",{"$f":"予選リーグ!B19","v":"10:00:00"},null,"チーム名",null,{"$f":"予選リーグ!C19","v":"竹田直入"},null,null,"-",{"$f":"予選リーグ!E19","v":"大道"},null,null,{"$f":"予選リーグ!D19","v":"鶴居"},null,null,"チーム名",null,{"$f":"予選リーグ!F19","v":"八坂"},null,null,"-",{"$f":"予選リーグ!H19","v":"宗方"},null,null,{"$f":"予選リーグ!G19","v":"WAYS"},null,null,null,"①",{"$f":"予選リーグ!B19","v":"10:00:00"},null,"チーム名",null,{"$f":"予選リーグ!I19","v":"中津沖代"},null,null,"-",{"$f":"予選リーグ!K19","v":"KINGS B"},null,null,{"$f":"予選リーグ!J19","v":"大平山"},null,null,"チーム名",null,{"$f":"予選リーグ!L19","v":"スマイス・セレソン"},null,null,"-",{"$f":"予選リーグ!N19","v":"REGATE"},null,null,{"$f":"予選リーグ!M19","v":"安岐"}]
[null,null,null,"得失点",null,1,null,null,"-",4,null,null,{"$f":"予選リーグ!D20","v":"MSS"},null,null,"得失点",null,2,null,null,"-",1,null,null,{"$f":"予選リーグ!G20","v":"トリニータ"},null,null,null,null,null,null,"得失点",null,2,null,null,"-",0,null,null,{"$f":"予選リーグ!J20","v":"玖珠"},null,null,"得失点",null,1,null,null,"-",0,null,null,{"$f":"予選リーグ!M20","v":"KINGS"}]
["②",{"$f":"予選リーグ!B21","v":"10:40:00"},null,"チーム名",null,{"$f":"予選リーグ!C21","v":"MSS"},null,null,"-",{"$f":"予選リーグ!E21","v":"由布川"},null,null,{"$f":"予選リーグ!D21","v":"竹田直入"},null,null,"チーム名",null,{"$f":"予選リーグ!F21","v":"トリニータ"},null,null,"-",{"$f":"予選リーグ!H21","v":"ブルーウイング"},null,null,{"$f":"予選リーグ!G21","v":"八坂"},null,null,null,"②",{"$f":"予選リーグ!B21","v":"10:40:00"},null,"チーム名",null,{"$f":"予選リーグ!I21","v":"玖珠"},null,null,"-",{"$f":"予選リーグ!K21","v":"ドリームキッズ"},null,null,{"$f":"予選リーグ!J21","v":"中津沖代"},null,null,"チーム名",null,{"$f":"予選リーグ!L21","v":"KINGS"},null,null,"-",{"$f":"予選リーグ!N21","v":"カティ高城"},null,null,{"$f":"予選リーグ!M21","v":"スマイス・セレソン"}]
[null,null,null,"得失点",null,2,null,null,"-",0,null,null,{"$f":"予選リーグ!D22","v":"大道"},null,null,"得失点",null,2,null,null,"-",0,null,null,{"$f":"予選リーグ!G22","v":"宗方"},null,null,null,null,null,null,"得失点",null,0,null,null,"-",6,null,null,{"$f":"予選リーグ!J22","v":"KINGS B"},null,null,"得失点",null,2,null,null,"-",1,null,null,{"$f":"予選リーグ!M22","v":"REGATE"}]
["③",{"$f":"予選リーグ!B23","v":"11:20:00"},null,"チーム名",null,{"$f":"予選リーグ!C23","v":"大道"},null,null,"-",{"$f":"予選リーグ!E23","v":"臼杵"},null,null,{"$f":"予選リーグ!D23","v":"MSS"},null,null,"チーム名",null,{"$f":"予選リーグ!F23","v":"宗方"},null,null,"-",{"$f":"予選リーグ!H23","v":"太陽大分西"},null,null,{"$f":"予選リーグ!G23","v":"トリニータ"},null,null,null,"③",{"$f":"予選リーグ!B23","v":"11:20:00"},null,"チーム名",null,{"$f":"予選リーグ!I23","v":"KINGS B"},null,null,"-",{"$f":"予選リーグ!K23","v":"津久見"},null,null,{"$f":"予選リーグ!J23","v":"玖珠"},null,null,"チーム名",null,{"$f":"予選リーグ!L23","v":"REGATE"},null,null,"-",{"$f":"予選リーグ!N23","v":"佐伯リベロ"},null,null,{"$f":"予選リーグ!M23","v":"KINGS"}]
[null,null,null,"得失点",null,10,null,null,"-",0,null,null,{"$f":"予選リーグ!D24","v":"由布川"},null,null,"得失点",null,2,null,null,"-",0,null,null,{"$f":"予選リーグ!G24","v":"ブルーウイング"},null,null,null,null,null,null,"得失点",null,10,null,null,"-",1,null,null,{"$f":"予選リーグ!J24","v":"ドリームキッズ"},null,null,"得失点",null,0,null,null,"-",2,null,null,{"$f":"予選リーグ!M24","v":"カティ高城"}]
["④",{"$f":"予選リーグ!B25","v":"12:00:00"},null,"チーム名",null,{"$f":"予選リーグ!C25","v":"由布川"},null,null,"-",{"$f":"予選リーグ!E25","v":"鶴居"},null,null,{"$f":"予選リーグ!D25","v":"大道"},null,null,"チーム名",null,{"$f":"予選リーグ!F25","v":"ブルーウイング"},null,null,"-",{"$f":"予選リーグ!H25","v":"WAYS"},null,null,{"$f":"予選リーグ!G25","v":"宗方"},null,null,null,"④",{"$f":"予選リーグ!B25","v":"12:00:00"},null,"チーム名",null,{"$f":"予選リーグ!I25","v":"ドリームキッズ"},null,null,"-",{"$f":"予選リーグ!K25","v":"大平山"},null,null,{"$f":"予選リーグ!J25","v":"KINGS B"},null,null,"チーム名",null,{"$f":"予選リーグ!L25","v":"カティ高城"},null,null,"-",{"$f":"予選リーグ!N25","v":"安岐"},null,null,{"$f":"予選リーグ!M25","v":"REGATE"}]
[null,null,null,"得失点",null,2,null,null,"-",1,null,null,{"$f":"予選リーグ!D26","v":"臼杵"},null,null,"得失点",null,6,null,null,"-",1,null,null,{"$f":"予選リーグ!G26","v":"太陽大分西"},null,null,null,null,null,null,"得失点",null,1,null,null,"-",0,null,null,{"$f":"予選リーグ!J26","v":"津久見"},null,null,"得失点",null,6,null,null,"-",0,null,null,{"$f":"予選リーグ!M26","v":"佐伯リベロ"}]
[null,{"$f":"予選リーグ!B27","v":"12:40:00"},null,"休　　　　憩",null,null,null,null,null,null,null,null,null,null,null,null,null,null,null,null,null,null,null,null,null,null,null,null,null,{"$f":"予選リーグ!B27","v":"12:40:00"},null,"休　　　　憩"]
[]
["⑤",{"$f":"予選リーグ!B29","v":"13:20:00"},null,"チーム名",null,{"$f":"予選リーグ!C29","v":"臼杵"},null,null,"-",{"$f":"予選リーグ!E29","v":"竹田直入"},null,null,{"$f":"予選リーグ!D29","v":"由布川"},null,null,"チーム名",null,{"$f":"予選リーグ!F29","v":"太陽大分西"},null,null,"-",{"$f":"予選リーグ!H29","v":"八坂"},null,null,{"$f":"予選リーグ!G29","v":"ブルーウイング"},null,null,null,"⑤",{"$f":"予選リーグ!B29","v":"13:20:00"},null,"チーム名",null,{"$f":"予選リーグ!I29","v":"津久見"},null,null,"-",{"$f":"予選リーグ!K29","v":"中津沖代"},null,null,{"$f":"予選リーグ!J29","v":"ドリームキッズ"},null,null,"チーム名",null,{"$f":"予選リーグ!L29","v":"佐伯リベロ"},null,null,"-",{"$f":"予選リーグ!N29","v":"スマイス・セレソン"},null,null,{"$f":"予選リーグ!M29","v":"カティ高城"}]
[null,null,null,"得失点",null,1,null,null,"-",6,null,null,{"$f":"予選リーグ!D30","v":"鶴居"},null,null,"得失点",null,4,null,null,"-",0,null,null,{"$f":"予選リーグ!G30","v":"WAYS"},null,null,null,null,null,null,"得失点",null,0,null,null,"-",4,null,null,{"$f":"予選リーグ!J30","v":"大平山"},null,null,"得失点",null,1,null,null,"-",2,null,null,{"$f":"予選リーグ!M30","v":"安岐"}]
["⑥",{"$f":"予選リーグ!B31","v":"14:00:00"},null,"チーム名",null,{"$f":"予選リーグ!C31","v":"鶴居"},null,null,"-",{"$f":"予選リーグ!E31","v":"MSS"},null,null,{"$f":"予選リーグ!D31","v":"臼杵"},null,null,"チーム名",null,{"$f":"予選リーグ!F31","v":"WAYS"},null,null,"-",{"$f":"予選リーグ!H31","v":"トリニータ"},null,null,{"$f":"予選リーグ!G31","v":"太陽大分西"},null,null,null,"⑥",{"$f":"予選リーグ!B31","v":"14:00:00"},null,"チーム名",null,{"$f":"予選リーグ!I31","v":"大平山"},null,null,"-",{"$f":"予選リーグ!K31","v":"玖珠"},null,null,{"$f":"予選リーグ!J31","v":"津久見"},null,null,"チーム名",null,{"$f":"予選リーグ!L31","v":"安岐"},null,null,"-",{"$f":"予選リーグ!N31","v":"KINGS"},null,null,{"$f":"予選リーグ!M31","v":"佐伯リベロ"}]
[null,null,null,"得失点",null,2,null,null,"-",6,null,null,{"$f":"予選リーグ!D32","v":"竹田直入"},null,null,"得失点",null,0,null,null,"-",4,null,null,{"$f":"予選リーグ!G32","v":"八坂"},null,null,null,null,null,null,"得失点",null,0,null,null,"-",0,null,null,{"$f":"予選リーグ!J32","v":"中津沖代"},null,null,"得失点",null,1,null,null,"-",11,null,null,{"$f":"予選リーグ!M32","v":"スマイス・セレソン"}]
[]
[]
[]
[]
[]
[]
[]
[]
[]
[]
[]
[]
[]
[]
[]
[]
[]
[]
[null,null,null,null,null,"勝点表","勝",3,null,"分",1,null,"負",0,null,null,null,null,null,null,null,null,null,null,null,null,null,null,null,null,null,null,null,"勝点表","勝",3,null,"分",1,null,"負",0]
[]
["Aパート",null,null,{"$f":"A48","v":"竹田直入"},null,null,{"$f":"A50","v":"大道"},null,null,{"$f":"A52","v":"臼杵"},null,null,"勝","分","敗","得\n点","失\n点","勝\n点","勝点\n順位",null,"得失\n点差",null,"得失\n順位",null,"ﾄｰﾀﾙ\n順位",null,null,null,"Eパート",null,null,{"$f":"AC48","v":"中津沖代"},null,null,{"$f":"AC50","v":"KINGS B"},null,null,{"$f":"AC52","v":"津久見"},null,null,"勝","分","敗","得\n点","失\n点","勝\n点","勝点\n順位",null,"得失\n点差",null,"得失\n順位",null,"ﾄｰﾀﾙ\n順位"]
[{"$f":"予選リーグ!D5","v":"竹田直入"},"星取表",null,null,null,null,null,{"$f":"IF(G49=\"\",\"\",IF(G49>I49,\"○\",IF(G49<I49,\"●\",IF(G49=I49,\"△\"))))","v":"●"},null,null,{"$f":"IF(J49=\"\",\"\",IF(J49>L49,\"○\",IF(J49<L49,\"●\",IF(J49=L49,\"△\"))))","v":"○"},null,{"$f":"COUNTIF(D48:L48,\"○\")","v":1},{"$f":"COUNTIF(D48:L48,\"△\")+COUNTIF(D48:L48,\"▲\")","v":0},{"$f":"COUNTIF(D48:L48,\"●\")","v":1},{"$f":"SUM(D49,G49,J49)","v":7},{"$f":"SUM(F49,I49,L49)","v":5},{"$f":"(M48*3)+(N48*1)","v":3},{"$f":"RANK(R48,R$48:R$53)","v":2},"位",{"$f":"P48-Q48","v":2},null,{"$f":"RANK(U48,U$48:U$53)","v":2},"位",2,null,null,null,{"$f":"予選リーグ!J5","v":"中津沖代"},"星取表",null,null,null,null,null,{"$f":"IF(AI49=\"\",\"\",IF(AI49>AK49,\"○\",IF(AI49<AK49,\"●\",IF(AI49=AK49,\"△\"))))","v":"○"},null,null,{"$f":"IF(AL49=\"\",\"\",IF(AL49>AN49,\"○\",IF(AL49<AN49,\"●\",IF(AL49=AN49,\"△\"))))","v":"○"},null,{"$f":"COUNTIF(AF48:AN48,\"○\")","v":2},{"$f":"COUNTIF(AF48:AN48,\"△\")+COUNTIF(AF48:AN48,\"▲\")","v":0},{"$f":"COUNTIF(AF48:AN48,\"●\")","v":0},{"$f":"SUM(AF49,AI49,AL49)","v":6},{"$f":"SUM(AH49,AK49,AN49)","v":0},{"$f":"(AO48*3)+(AP48*1)","v":6},{"$f":"RANK(AT48,AT$48:AT$53)","v":1},"位",{"$f":"AR48-AS48","v":6},null,{"$f":"RANK(AW48,AW$48:AW$53)","v":2},"位",1]
[null,"得失点",null,null,null,null,{"$f":"F14","v":1},"-",{"$f":"J14","v":4},{"$f":"J24","v":6},"-",{"$f":"F24","v":1},null,null,null,null,null,null,null,null,null,null,null,null,null,null,null,null,null,"得失点",null,null,null,null,{"$f":"AH14","v":2},"-",{"$f":"AL14","v":0},{"$f":"AL24","v":4},"-",{"$f":"AH24","v":0}]
[{"$f":"予選リーグ!C7","v":"大道"},"星取表",null,null,{"$f":"IF(D51=\"\",\"\",IF(D51>F51,\"○\",IF(D51<F51,\"●\",IF(D51=F51,\"△\"))))","v":"○"},null,null,null,null,null,{"$f":"IF(J51=\"\",\"\",IF(J51>L51,\"○\",IF(J51<L51,\"●\",IF(J51=L51,\"△\"))))","v":"○"},null,{"$f":"COUNTIF(D50:L50,\"○\")","v":2},{"$f":"COUNTIF(D50:L50,\"△\")+COUNTIF(D50:L50,\"▲\")","v":0},{"$f":"COUNTIF(D50:L50,\"●\")","v":0},{"$f":"SUM(D51,G51,J51)","v":14},{"$f":"SUM(F51,I51,L51)","v":1},{"$f":"(M50*3)+(N50*1)","v":6},{"$f":"RANK(R50,R$48:R$53)","v":1},"位",{"$f":"P50-Q50","v":13},null,{"$f":"RANK(U50,U$48:U$53)","v":1},"位",1,null,null,null,{"$f":"予選リーグ!I7","v":"KINGS B"},"星取表",null,null,{"$f":"IF(AF51=\"\",\"\",IF(AF51>AH51,\"○\",IF(AF51<AH51,\"●\",IF(AF51=AH51,\"△\"))))","v":"●"},null,null,null,null,null,{"$f":"IF(AL51=\"\",\"\",IF(AL51>AN51,\"○\",IF(AL51<AN51,\"●\",IF(AL51=AN51,\"△\"))))","v":"○"},null,{"$f":"COUNTIF(AF50:AN50,\"○\")","v":1},{"$f":"COUNTIF(AF50:AN50,\"△\")+COUNTIF(AF50:AN50,\"▲\")","v":0},{"$f":"COUNTIF(AF50:AN50,\"●\")","v":1},{"$f":"SUM(AF51,AI51,AL51)","v":10},{"$f":"SUM(AH51,AK51,AN51)","v":3},{"$f":"(AO50*3)+(AP50*1)","v":3},{"$f":"RANK(AT50,AT$48:AT$53)","v":2},"位",{"$f":"AR50-AS50","v":7},null,{"$f":"RANK(AW50,AW$48:AW$53)","v":1},"位",2]
[null,"得失点",null,{"$f":"I49","v":4},"-",{"$f":"G49","v":1},null,null,null,{"$f":"F18","v":10},"-",{"$f":"J18","v":0},null,null,null,null,null,null,null,null,null,null,null,null,null,null,null,null,null,"得失点",null,{"$f":"AK49","v":0},"-",{"$f":"AI49","v":2},null,null,null,{"$f":"AH18","v":10},"-",{"$f":"AL18","v":1}]
[{"$f":"予選リーグ!E7","v":"臼杵"},"星取表",null,null,{"$f":"IF(D53=\"\",\"\",IF(D53>F53,\"○\",IF(D53<F53,\"●\",IF(D53=F53,\"△\"))))","v":"●"},null,null,{"$f":"IF(G53=\"\",\"\",IF(G53>I53,\"○\",IF(G53<I53,\"●\",IF(G53=I53,\"△\"))))","v":"●"},null,null,null,null,{"$f":"COUNTIF(D52:L52,\"○\")","v":0},{"$f":"COUNTIF(D52:L52,\"△\")+COUNTIF(D52:L52,\"▲\")","v":0},{"$f":"COUNTIF(D52:L52,\"●\")","v":2},{"$f":"SUM(D53,G53,J53)","v":1},{"$f":"SUM(F53,I53,L53)","v":16},{"$f":"(M52*3)+(N52*1)","v":0},{"$f":"RANK(R52,R$48:R$53)","v":3},"位",{"$f":"P52-Q52","v":-15},null,{"$f":"RANK(U52,U$48:U$53)","v":3},"位",3,null,null,null,{"$f":"予選リーグ!K7","v":"津久見"},"星取表",null,null,{"$f":"IF(AF53=\"\",\"\",IF(AF53>AH53,\"○\",IF(AF53<AH53,\"●\",IF(AF53=AH53,\"△\"))))","v":"●"},null,null,{"$f":"IF(AI53=\"\",\"\",IF(AI53>AK53,\"○\",IF(AI53<AK53,\"●\",IF(AI53=AK53,\"△\"))))","v":"●"},null,null,null,null,{"$f":"COUNTIF(AF52:AN52,\"○\")","v":0},{"$f":"COUNTIF(AF52:AN52,\"△\")+COUNTIF(AF52:AN52,\"▲\")","v":0},{"$f":"COUNTIF(AF52:AN52,\"●\")","v":2},{"$f":"SUM(AF53,AI53,AL53)","v":1},{"$f":"SUM(AH53,AK53,AN53)","v":14},{"$f":"(AO52*3)+(AP52*1)","v":0},{"$f":"RANK(AT52,AT$48:AT$53)","v":3},"位",{"$f":"AR52-AS52","v":-13},null,{"$f":"RANK(AW52,AW$48:AW$53)","v":3},"位",3]
[null,"得失点",null,{"$f":"L49","v":1},"-",{"$f":"J49","v":6},{"$f":"L51","v":0},"-",{"$f":"J51","v":10},null,null,null,null,null,null,null,null,null,null,null,null,null,null,null,null,null,null,null,null,"得失点",null,{"$f":"AN49","v":0},"-",{"$f":"AL49","v":4},{"$f":"AN51","v":1},"-",{"$f":"AL51","v":10}]
[]
["Bパート",null,null,{"$f":"A56","v":"八坂"},null,null,{"$f":"A58","v":"宗方"},null,null,{"$f":"A60","v":"太陽大分西"},null,null,"勝","分","敗","得\n点","失\n点","勝\n点","勝点\n順位",null,"得失\n点差",null,"得失\n順位",null,"ﾄｰﾀﾙ\n順位",null,null,null,"Fパート",null,null,{"$f":"AC56","v":"スマイス・セレソン"},null,null,{"$f":"AC58","v":"REGATE"},null,null,{"$f":"AC60","v":"佐伯リベロ"},null,null,"勝","分","敗","得\n点","失\n点","勝\n点","勝点\n順位",null,"得失\n点差",null,"得失\n順位",null,"ﾄｰﾀﾙ\n順位"]
[{"$f":"予選リーグ!G5","v":"八坂"},"星取表",null,null,null,null,null,{"$f":"IF(G57=\"\",\"\",IF(G57>I57,\"○\",IF(G57<I57,\"●\",IF(G57=I57,\"△\"))))","v":"○"},null,null,{"$f":"IF(J57=\"\",\"\",IF(J57>L57,\"○\",IF(J57<L57,\"●\",IF(J57=L57,\"△\"))))","v":"●"},null,{"$f":"COUNTIF(D56:L56,\"○\")","v":1},{"$f":"COUNTIF(D56:L56,\"△\")+COUNTIF(D56:L56,\"▲\")","v":0},{"$f":"COUNTIF(D56:L56,\"●\")","v":1},{"$f":"SUM(D57,G57,J57)","v":2},{"$f":"SUM(F57,I57,L57)","v":5},{"$f":"(M56*3)+(N56*1)","v":3},{"$f":"RANK(R56,$R$56:$R$61)","v":1},"位",{"$f":"P56-Q56","v":-3},null,{"$f":"RANK(U56,$U$56:$V$61)","v":3},"位",3,null,null,null,{"$f":"予選リーグ!M5","v":"スマイス・セレソン"},"星取表",null,null,null,null,null,{"$f":"IF(AI57=\"\",\"\",IF(AI57>AK57,\"○\",IF(AI57<AK57,\"●\",IF(AI57=AK57,\"△\"))))","v":"○"},null,null,{"$f":"IF(AL57=\"\",\"\",IF(AL57>AN57,\"○\",IF(AL57<AN57,\"●\",IF(AL57=AN57,\"△\"))))","v":"○"},null,{"$f":"COUNTIF(AF56:AN56,\"○\")","v":2},{"$f":"COUNTIF(AF56:AN56,\"△\")+COUNTIF(AF56:AN56,\"▲\")","v":0},{"$f":"COUNTIF(AF56:AN56,\"●\")","v":0},{"$f":"SUM(AF57,AI57,AL57)","v":3},{"$f":"SUM(AH57,AK57,AN57)","v":1},{"$f":"(AO56*3)+(AP56*1)","v":6},{"$f":"RANK(AT56,$AT$56:$AT$61)","v":1},"位",{"$f":"AR56-AS56","v":2},null,{"$f":"RANK(AW56,$AW$56:$AW$61)","v":1},"位",1]
[null,"得失点",null,null,null,null,{"$f":"R14","v":2},"-",{"$f":"V14","v":1},{"$f":"V24","v":0},"-",{"$f":"R24","v":4},null,null,null,null,null,null,null,null,null,null,null,null,null,null,null,null,null,"得失点",null,null,null,null,{"$f":"AT14","v":1},"-",{"$f":"AX14","v":0},{"$f":"AX24","v":2},"-",{"$f":"AT24","v":1}]
[{"$f":"予選リーグ!F7","v":"宗方"},"星取表",null,null,{"$f":"IF(D59=\"\",\"\",IF(D59>F59,\"○\",IF(D59<F59,\"●\",IF(D59=F59,\"△\"))))","v":"●"},null,null,null,null,null,{"$f":"IF(J59=\"\",\"\",IF(J59>L59,\"○\",IF(J59<L59,\"●\",IF(J59=L59,\"△\"))))","v":"○"},null,{"$f":"COUNTIF(D58:L58,\"○\")","v":1},{"$f":"COUNTIF(D58:L58,\"△\")+COUNTIF(D58:L58,\"▲\")","v":0},{"$f":"COUNTIF(D58:L58,\"●\")","v":1},{"$f":"SUM(D59,G59,J59)","v":3},{"$f":"SUM(F59,I59,L59)","v":2},{"$f":"(M58*3)+(N58*1)","v":3},{"$f":"RANK(R58,$R$56:$R$61)","v":1},"位",{"$f":"P58-Q58","v":1},null,{"$f":"RANK(U58,$U$56:$V$61)","v":2},"位",2,null,null,null,{"$f":"予選リーグ!L7","v":"REGATE"},"星取表",null,null,{"$f":"IF(AF59=\"\",\"\",IF(AF59>AH59,\"○\",IF(AF59<AH59,\"●\",IF(AF59=AH59,\"△\"))))","v":"●"},null,null,null,null,null,{"$f":"IF(AL59=\"\",\"\",IF(AL59>AN59,\"○\",IF(AL59<AN59,\"●\",IF(AL59=AN59,\"△\"))))","v":"●"},null,{"$f":"COUNTIF(AF58:AN58,\"○\")","v":0},{"$f":"COUNTIF(AF58:AN58,\"△\")+COUNTIF(AF58:AN58,\"▲\")","v":0},{"$f":"COUNTIF(AF58:AN58,\"●\")","v":2},{"$f":"SUM(AF59,AI59,AL59)","v":0},{"$f":"SUM(AH59,AK59,AN59)","v":3},{"$f":"(AO58*3)+(AP58*1)","v":0},{"$f":"RANK(AT58,$AT$56:$AT$61)","v":3},"位",{"$f":"AR58-AS58","v":-3},null,{"$f":"RANK(AW58,$AW$56:$AW$61)","v":3},"位",3]
[null,"得失点",null,{"$f":"I57","v":1},"-",{"$f":"G57","v":2},null,null,null,{"$f":"R18","v":2},"-",{"$f":"V18","v":0},null,null,null,null,null,null,null,null,null,null,null,null,null,null,null,null,null,"得失点",null,{"$f":"AK57","v":0},"-",{"$f":"AI57","v":1},null,null,null,{"$f":"AT18","v":0},"-",{"$f":"AX18","v":2}]
[{"$f":"予選リーグ!H7","v":"太陽大分西"},"星取表",null,null,{"$f":"IF(D61=\"\",\"\",IF(D61>F61,\"○\",IF(D61<F61,\"●\",IF(D61=F61,\"△\"))))","v":"○"},null,null,{"$f":"IF(G61=\"\",\"\",IF(G61>I61,\"○\",IF(G61<I61,\"●\",IF(G61=I61,\"△\"))))","v":"●"},null,null,null,null,{"$f":"COUNTIF(D60:L60,\"○\")","v":1},{"$f":"COUNTIF(D60:L60,\"△\")+COUNTIF(D60:L60,\"▲\")","v":0},{"$f":"COUNTIF(D60:L60,\"●\")","v":1},{"$f":"SUM(D61,G61,J61)","v":4},{"$f":"SUM(F61,I61,L61)","v":2},{"$f":"(M60*3)+(N60*1)","v":3},{"$f":"RANK(R60,$R$56:$R$61)","v":1},"位",{"$f":"P60-Q60","v":2},null,{"$f":"RANK(U60,$U$56:$V$61)","v":1},"位",1,null,null,null,{"$f":"予選リーグ!N7","v":"佐伯リベロ"},"星取表",null,null,{"$f":"IF(AF61=\"\",\"\",IF(AF61>AH61,\"○\",IF(AF61<AH61,\"●\",IF(AF61=AH61,\"△\"))))","v":"●"},null,null,{"$f":"IF(AI61=\"\",\"\",IF(AI61>AK61,\"○\",IF(AI61<AK61,\"●\",IF(AI61=AK61,\"△\"))))","v":"○"},null,null,null,null,{"$f":"COUNTIF(AF60:AN60,\"○\")","v":1},{"$f":"COUNTIF(AF60:AN60,\"△\")+COUNTIF(AF60:AN60,\"▲\")","v":0},{"$f":"COUNTIF(AF60:AN60,\"●\")","v":1},{"$f":"SUM(AF61,AI61,AL61)","v":3},{"$f":"SUM(AH61,AK61,AN61)","v":2},{"$f":"(AO60*3)+(AP60*1)","v":3},{"$f":"RANK(AT60,$AT$56:$AT$61)","v":2},"位",{"$f":"AR60-AS60","v":1},null,{"$f":"RANK(AW60,$AW$56:$AW$61)","v":2},"位",2]
[null,"得失点",null,{"$f":"L57","v":4},"-",{"$f":"J57","v":0},{"$f":"L59","v":0},"-",{"$f":"J59","v":2},null,null,null,null,null,null,null,null,null,null,null,null,null,null,null,null,null,null,null,null,"得失点",null,{"$f":"AN57","v":1},"-",{"$f":"AL57","v":2},{"$f":"AN59","v":2},"-",{"$f":"AL59","v":0}]
[]
["Cパート",null,null,{"$f":"A64","v":"MSS"},null,null,{"$f":"A66","v":"由布川"},null,null,{"$f":"A68","v":"鶴居"},null,null,"勝","分","敗","得\n点","失\n点","勝\n点","勝点\n順位",null,"得失\n点差",null,"得失\n順位",null,"ﾄｰﾀﾙ\n順位",null,null,null,"Gパート",null,null,{"$f":"AC64","v":"玖珠"},null,null,{"$f":"AC66","v":"ドリームキッズ"},null,null,{"$f":"AC68","v":"大平山"},null,null,"勝","分","敗","得\n点","失\n点","勝\n点","勝点\n順位",null,"得失\n点差",null,"得失\n順位",null,"ﾄｰﾀﾙ\n順位"]
[{"$f":"予選リーグ!D10","v":"MSS"},"星取表",null,null,null,null,null,{"$f":"IF(G65=\"\",\"\",IF(G65>I65,\"○\",IF(G65<I65,\"●\",IF(G65=I65,\"△\"))))","v":"○"},null,null,{"$f":"IF(J65=\"\",\"\",IF(J65>L65,\"○\",IF(J65<L65,\"●\",IF(J65=L65,\"△\"))))","v":"○"},null,{"$f":"COUNTIF(D64:L64,\"○\")","v":2},{"$f":"COUNTIF(D64:L64,\"△\")+COUNTIF(D64:L64,\"▲\")","v":0},{"$f":"COUNTIF(D64:L64,\"●\")","v":0},{"$f":"SUM(D65,G65,J65)","v":8},{"$f":"SUM(F65,I65,L65)","v":2},{"$f":"(M64*3)+(N64*1)","v":6},{"$f":"RANK(R64,$R$64:$R$69)","v":1},"位",{"$f":"P64-Q64","v":6},null,{"$f":"RANK(U64,$U$64:$V$69)","v":1},"位",1,null,null,null,{"$f":"予選リーグ!J10","v":"玖珠"},"星取表",null,null,null,null,null,{"$f":"IF(AI65=\"\",\"\",IF(AI65>AK65,\"○\",IF(AI65<AK65,\"●\",IF(AI65=AK65,\"△\"))))","v":"●"},null,null,{"$f":"IF(AL65=\"\",\"\",IF(AL65>AN65,\"○\",IF(AL65<AN65,\"●\",IF(AL65=AN65,\"△\"))))","v":"△"},null,{"$f":"COUNTIF(AF64:AN64,\"○\")","v":0},{"$f":"COUNTIF(AF64:AN64,\"△\")+COUNTIF(AF64:AN64,\"▲\")","v":1},{"$f":"COUNTIF(AF64:AN64,\"●\")","v":1},{"$f":"SUM(AF65,AI65,AL65)","v":0},{"$f":"SUM(AH65,AK65,AN65)","v":6},{"$f":"(AO64*3)+(AP64*1)","v":1},{"$f":"RANK(AT64,$AT$64:$AT$69)","v":2},"位",{"$f":"AR64-AS64","v":-6},null,{"$f":"RANK(AW64,$AW$64:$AW$69)","v":3},"位",3]
[null,"得失点",null,null,null,null,{"$f":"F16","v":2},"-",{"$f":"J16","v":0},{"$f":"J26","v":6},"-",{"$f":"F26","v":2},null,null,null,null,null,null,null,null,null,null,null,null,null,null,null,null,null,"得失点",null,null,null,null,{"$f":"AH16","v":0},"-",{"$f":"AL16","v":6},{"$f":"AL26","v":0},"-",{"$f":"AH26","v":0}]
[{"$f":"予選リーグ!C12","v":"由布川"},"星取表",null,null,{"$f":"IF(D67=\"\",\"\",IF(D67>F67,\"○\",IF(D67<F67,\"●\",IF(D67=F67,\"△\"))))","v":"●"},null,null,null,null,null,{"$f":"IF(J67=\"\",\"\",IF(J67>L67,\"○\",IF(J67<L67,\"●\",IF(J67=L67,\"△\"))))","v":"○"},null,{"$f":"COUNTIF(D66:L66,\"○\")","v":1},{"$f":"COUNTIF(D66:L66,\"△\")+COUNTIF(D66:L66,\"▲\")","v":0},{"$f":"COUNTIF(D66:L66,\"●\")","v":1},{"$f":"SUM(D67,G67,J67)","v":2},{"$f":"SUM(F67,I67,L67)","v":3},{"$f":"(M66*3)+(N66*1)","v":3},{"$f":"RANK(R66,$R$64:$R$69)","v":2},"位",{"$f":"P66-Q66","v":-1},null,{"$f":"RANK(U66,$U$64:$V$69)","v":2},"位",2,null,null,null,{"$f":"予選リーグ!I12","v":"ドリームキッズ"},"星取表",null,null,{"$f":"IF(AF67=\"\",\"\",IF(AF67>AH67,\"○\",IF(AF67<AH67,\"●\",IF(AF67=AH67,\"△\"))))","v":"○"},null,null,null,null,null,{"$f":"IF(AL67=\"\",\"\",IF(AL67>AN67,\"○\",IF(AL67<AN67,\"●\",IF(AL67=AN67,\"△\"))))","v":"○"},null,{"$f":"COUNTIF(AF66:AN66,\"○\")","v":2},{"$f":"COUNTIF(AF66:AN66,\"△\")+COUNTIF(AF66:AN66,\"▲\")","v":0},{"$f":"COUNTIF(AF66:AN66,\"●\")","v":0},{"$f":"SUM(AF67,AI67,AL67)","v":7},{"$f":"SUM(AH67,AK67,AN67)","v":0},{"$f":"(AO66*3)+(AP66*1)","v":6},{"$f":"RANK(AT66,$AT$64:$AT$69)","v":1},"位",{"$f":"AR66-AS66","v":7},null,{"$f":"RANK(AW66,$AW$64:$AW$69)","v":1},"位",1]
[null,"得失点",null,{"$f":"I65","v":0},"-",{"$f":"G65","v":2},null,null,null,{"$f":"F20","v":2},"-",{"$f":"J20","v":1},null,null,null,null,null,null,null,null,null,null,null,null,null,null,null,null,null,"得失点",null,{"$f":"AK65","v":6},"-",{"$f":"AI65","v":0},null,null,null,{"$f":"AH20","v":1},"-",{"$f":"AL20","v":0}]
[{"$f":"予選リーグ!E12","v":"鶴居"},"星取表",null,null,{"$f":"IF(D69=\"\",\"\",IF(D69>F69,\"○\",IF(D69<F69,\"●\",IF(D69=F69,\"△\"))))","v":"●"},null,null,{"$f":"IF(G69=\"\",\"\",IF(G69>I69,\"○\",IF(G69<I69,\"●\",IF(G69=I69,\"△\"))))","v":"●"},null,null,null,null,{"$f":"COUNTIF(D68:L68,\"○\")","v":0},{"$f":"COUNTIF(D68:L68,\"△\")+COUNTIF(D68:L68,\"▲\")","v":0},{"$f":"COUNTIF(D68:L68,\"●\")","v":2},{"$f":"SUM(D69,G69,J69)","v":3},{"$f":"SUM(F69,I69,L69)","v":8},{"$f":"(M68*3)+(N68*1)","v":0},{"$f":"RANK(R68,$R$64:$R$69)","v":3},"位",{"$f":"P68-Q68","v":-5},null,{"$f":"RANK(U68,$U$64:$V$69)","v":3},"位",3,null,null,null,{"$f":"予選リーグ!K12","v":"大平山"},"星取表",null,null,{"$f":"IF(AF69=\"\",\"\",IF(AF69>AH69,\"○\",IF(AF69<AH69,\"●\",IF(AF69=AH69,\"△\"))))","v":"△"},null,null,{"$f":"IF(AI69=\"\",\"\",IF(AI69>AK69,\"○\",IF(AI69<AK69,\"●\",IF(AI69=AK69,\"△\"))))","v":"●"},null,null,null,null,{"$f":"COUNTIF(AF68:AN68,\"○\")","v":0},{"$f":"COUNTIF(AF68:AN68,\"△\")+COUNTIF(AF68:AN68,\"▲\")","v":1},{"$f":"COUNTIF(AF68:AN68,\"●\")","v":1},{"$f":"SUM(AF69,AI69,AL69)","v":0},{"$f":"SUM(AH69,AK69,AN69)","v":1},{"$f":"(AO68*3)+(AP68*1)","v":1},{"$f":"RANK(AT68,$AT$64:$AT$69)","v":2},"位",{"$f":"AR68-AS68","v":-1},null,{"$f":"RANK(AW68,$AW$64:$AW$69)","v":2},"位",2]
[null,"得失点",null,{"$f":"L65","v":2},"-",{"$f":"J65","v":6},{"$f":"L67","v":1},"-",{"$f":"J67","v":2},null,null,null,null,null,null,null,null,null,null,null,null,null,null,null,null,null,null,null,null,"得失点",null,{"$f":"AN65","v":0},"-",{"$f":"AL65","v":0},{"$f":"AN67","v":0},"-",{"$f":"AL67","v":1}]
[]
["Dパート",null,null,{"$f":"A72","v":"トリニータ"},null,null,{"$f":"A74","v":"ブルーウイング"},null,null,{"$f":"A76","v":"WAYS"},null,null,"勝","分","敗","得\n点","失\n点","勝\n点","勝点\n順位",null,"得失\n点差",null,"得失\n順位",null,"ﾄｰﾀﾙ\n順位",null,null,null,"Hパート",null,null,{"$f":"AC72","v":"KINGS"},null,null,{"$f":"AC74","v":"カティ高城"},null,null,{"$f":"AC76","v":"安岐"},null,null,"勝","分","敗","得\n点","失\n点","勝\n点","勝点\n順位",null,"得失\n点差",null,"得失\n順位",null,"ﾄｰﾀﾙ\n順位"]
[{"$f":"予選リーグ!G10","v":"トリニータ"},"星取表",null,null,null,null,null,{"$f":"IF(G73=\"\",\"\",IF(G73>I73,\"○\",IF(G73<I73,\"●\",IF(G73=I73,\"△\"))))","v":"○"},null,null,{"$f":"IF(J73=\"\",\"\",IF(J73>L73,\"○\",IF(J73<L73,\"●\",IF(J73=L73,\"△\"))))","v":"○"},null,{"$f":"COUNTIF(D72:L72,\"○\")","v":2},{"$f":"COUNTIF(D72:L72,\"△\")+COUNTIF(D72:L72,\"▲\")","v":0},{"$f":"COUNTIF(D72:L72,\"●\")","v":0},{"$f":"SUM(D73,G73,J73)","v":6},{"$f":"SUM(F73,I73,L73)","v":0},{"$f":"(M72*3)+(N72*1)","v":6},{"$f":"RANK(R72,$R$72:$R$77)","v":1},"位",{"$f":"P72-Q72","v":6},null,{"$f":"RANK(U72,$U$72:$V$77)","v":1},"位",1,null,null,null,{"$f":"予選リーグ!M10","v":"KINGS"},"星取表",null,null,null,null,null,{"$f":"IF(AI73=\"\",\"\",IF(AI73>AK73,\"○\",IF(AI73<AK73,\"●\",IF(AI73=AK73,\"△\"))))","v":"○"},null,null,{"$f":"IF(AL73=\"\",\"\",IF(AL73>AN73,\"○\",IF(AL73<AN73,\"●\",IF(AL73=AN73,\"△\"))))","v":"○"},null,{"$f":"COUNTIF(AF72:AN72,\"○\")","v":2},{"$f":"COUNTIF(AF72:AN72,\"△\")+COUNTIF(AF72:AN72,\"▲\")","v":0},{"$f":"COUNTIF(AF72:AN72,\"●\")","v":0},{"$f":"SUM(AF73,AI73,AL73)","v":13},{"$f":"SUM(AH73,AK73,AN73)","v":2},{"$f":"(AO72*3)+(AP72*1)","v":6},{"$f":"RANK(AT72,$AT$72:$AT$77)","v":1},"位",{"$f":"AR72-AS72","v":11},null,{"$f":"RANK(AW72,$AW$72:$AW$77)","v":1},"位",1]
[null,"得失点",null,null,null,null,{"$f":"R16","v":2},"-",{"$f":"V16","v":0},{"$f":"V26","v":4},"-",{"$f":"R26","v":0},null,null,null,null,null,null,null,null,null,null,null,null,null,null,null,null,null,"得失点",null,null,null,null,{"$f":"AT16","v":2},"-",{"$f":"AX16","v":1},{"$f":"AX26","v":11},"-",{"$f":"AT26","v":1}]
[{"$f":"予選リーグ!F12","v":"ブルーウイング"},"星取表",null,null,{"$f":"IF(D75=\"\",\"\",IF(D75>F75,\"○\",IF(D75<F75,\"●\",IF(D75=F75,\"△\"))))","v":"●"},null,null,null,null,null,{"$f":"IF(J75=\"\",\"\",IF(J75>L75,\"○\",IF(J75<L75,\"●\",IF(J75=L75,\"△\"))))","v":"○"},null,{"$f":"COUNTIF(D74:L74,\"○\")","v":1},{"$f":"COUNTIF(D74:L74,\"△\")+COUNTIF(D74:L74,\"▲\")","v":0},{"$f":"COUNTIF(D74:L74,\"●\")","v":1},{"$f":"SUM(D75,G75,J75)","v":6},{"$f":"SUM(F75,I75,L75)","v":3},{"$f":"(M74*3)+(N74*1)","v":3},{"$f":"RANK(R74,$R$72:$R$77)","v":2},"位",{"$f":"P74-Q74","v":3},null,{"$f":"RANK(U74,$U$72:$V$77)","v":2},"位",2,null,null,null,{"$f":"予選リーグ!L12","v":"カティ高城"},"星取表",null,null,{"$f":"IF(AF75=\"\",\"\",IF(AF75>AH75,\"○\",IF(AF75<AH75,\"●\",IF(AF75=AH75,\"△\"))))","v":"●"},null,null,null,null,null,{"$f":"IF(AL75=\"\",\"\",IF(AL75>AN75,\"○\",IF(AL75<AN75,\"●\",IF(AL75=AN75,\"△\"))))","v":"○"},null,{"$f":"COUNTIF(AF74:AN74,\"○\")","v":1},{"$f":"COUNTIF(AF74:AN74,\"△\")+COUNTIF(AF74:AN74,\"▲\")","v":0},{"$f":"COUNTIF(AF74:AN74,\"●\")","v":1},{"$f":"SUM(AF75,AI75,AL75)","v":7},{"$f":"SUM(AH75,AK75,AN75)","v":2},{"$f":"(AO74*3)+(AP74*1)","v":3},{"$f":"RANK(AT74,$AT$72:$AT$77)","v":2},"位",{"$f":"AR74-AS74","v":5},null,{"$f":"RANK(AW74,$AW$72:$AW$77)","v":2},"位",2]
[null,"得失点",null,{"$f":"I73","v":0},"-",{"$f":"G73","v":2},null,null,null,{"$f":"R20","v":6},"-",{"$f":"V20","v":1},null,null,null,null,null,null,null,null,null,null,null,null,null,null,null,null,null,"得失点",null,{"$f":"AK73","v":1},"-",{"$f":"AI73","v":2},null,null,null,{"$f":"AT20","v":6},"-",{"$f":"AX20","v":0}]
[{"$f":"予選リーグ!H12","v":"WAYS"},"星取表",null,null,{"$f":"IF(D77=\"\",\"\",IF(D77>F77,\"○\",IF(D77<F77,\"●\",IF(D77=F77,\"△\"))))","v":"●"},null,null,{"$f":"IF(G77=\"\",\"\",IF(G77>I77,\"○\",IF(G77<I77,\"●\",IF(G77=I77,\"△\"))))","v":"●"},null,null,null,null,{"$f":"COUNTIF(D76:L76,\"○\")","v":0},{"$f":"COUNTIF(D76:L76,\"△\")+COUNTIF(D76:L76,\"▲\")","v":0},{"$f":"COUNTIF(D76:L76,\"●\")","v":2},{"$f":"SUM(D77,G77,J77)","v":1},{"$f":"SUM(F77,I77,L77)","v":10},{"$f":"(M76*3)+(N76*1)","v":0},{"$f":"RANK(R76,$R$72:$R$77)","v":3},"位",{"$f":"P76-Q76","v":-9},null,{"$f":"RANK(U76,$U$72:$V$77)","v":3},"位",3,null,null,null,{"$f":"予選リーグ!N12","v":"安岐"},"星取表",null,null,{"$f":"IF(AF77=\"\",\"\",IF(AF77>AH77,\"○\",IF(AF77<AH77,\"●\",IF(AF77=AH77,\"△\"))))","v":"●"},null,null,{"$f":"IF(AI77=\"\",\"\",IF(AI77>AK77,\"○\",IF(AI77<AK77,\"●\",IF(AI77=AK77,\"△\"))))","v":"●"},null,null,null,null,{"$f":"COUNTIF(AF76:AN76,\"○\")","v":0},{"$f":"COUNTIF(AF76:AN76,\"△\")+COUNTIF(AF76:AN76,\"▲\")","v":0},{"$f":"COUNTIF(AF76:AN76,\"●\")","v":2},{"$f":"SUM(AF77,AI77,AL77)","v":1},{"$f":"SUM(AH77,AK77,AN77)","v":17},{"$f":"(AO76*3)+(AP76*1)","v":0},{"$f":"RANK(AT76,$AT$72:$AT$77)","v":3},"位",{"$f":"AR76-AS76","v":-16},null,{"$f":"RANK(AW76,$AW$72:$AW$77)","v":3},"位",3]
[null,"得失点",null,{"$f":"L73","v":0},"-",{"$f":"J73","v":4},{"$f":"L75","v":1},"-",{"$f":"J75","v":6},null,null,null,null,null,null,null,null,null,null,null,null,null,null,null,null,null,null,null,null,"得失点",null,{"$f":"AN73","v":1},"-",{"$f":"AL73","v":11},{"$f":"AN75","v":0},"-",{"$f":"AL75","v":6}]

{"sheet":"予選リーグ公式記録(A北)","index":8,"n_rows":89,"n_cols":31,"rows_kept":89,"cut":false,"hidden":false,"merged":[[67,28,69,28],[67,29,69,29],[67,27,69,27],[59,1,59,2],[59,17,59,18],[9,30,11,30],[38,30,40,30],[67,30,69,30],[0,0,0,9],[0,10,0,13],[0,16,0,25],[0,26,0,29],[12,0,12,3],[12,16,12,19],[41,0,41,3],[41,16,41,19],[54,1,54,3],[54,17,54,19],[55,1,55,2],[55,17,55,18],[56,1,56,3],[56,17,56,19],[38,28,40,28],[38,29,40,29],[86,1,86,2],[86,17,86,18],[87,1,87,3],[87,17,87,19],[88,1,88,2],[88,17,88,18],[83,1,83,3],[83,17,83,19],[84,1,84,2],[84,17,84,18],[85,1,85,3],[85,17,85,19],[82,1,82,2],[82,17,82,18],[67,13,69,13],[67,20,69,20],[67,21,69,21],[67,22,69,22],[67,23,69,23],[67,4,69,4],[67,5,69,5],[67,6,69,6],[67,7,69,7],[67,11,69,11],[67,12,69,12],[67,14,69,14],[70,0,70,3],[70,16,70,19],[68,1,68,3],[69,1,69,3],[68,17,68,19],[69,17,69,19],[67,1,67,3],[67,17,67,19],[38,27,40,27],[38,14,40,14],[30,1,30,2],[30,17,30,18],[38,4,40,4],[38,5,40,5],[38,6,40,6],[38,7,40,7],[81,1,81,3],[81,17,81,19],[57,1,57,2],[57,17,57,18],[58,1,58,3],[58,17,58,19],[52,1,52,3],[52,17,52,19],[53,1,53,2],[53,17,53,18],[38,13,40,13],[38,11,40,11],[38,12,40,12],[38,20,40,20],[38,21,40,21],[38,22,40,22],[38,23,40,23],[29,1,29,3],[29,17,29,19],[23,1,23,3],[24,1,24,2],[25,1,25,3],[27,1,27,3],[27,17,27,19],[28,1,28,2],[28,17,28,18],[39,1,39,3],[40,1,40,3],[39,17,39,19],[40,17,40,19],[38,1,38,3],[38,17,38,19],[9,4,11,4],[9,5,11,5],[9,6,11,6],[9,7,11,7],[9,11,11,11],[9,14,11,14],[26,1,26,2],[26,17,26,18],[23,17,23,19],[24,17,24,18],[25,17,25,19],[9,1,9,3],[10,1,10,3],[11,1,11,3],[4,28,4,29],[5,28,5,29],[4,21,4,27],[5,21,5,27],[4,12,4,13],[4,5,4,11],[5,5,5,11],[5,12,5,13],[9,13,11,13],[9,12,11,12],[6,28,6,29],[9,20,11,20],[9,21,11,21],[9,23,11,23],[6,12,6,13],[9,27,11,27],[9,28,11,28],[9,29,11,29],[9,22,11,22],[6,21,6,27],[6,5,6,11],[10,17,10,19],[11,17,11,19],[9,17,9,19]]}
["OFA 第 30 回 大分県ジュニアサッカー選手権大会",null,null,null,null,null,null,null,null,null,"予選リーグ結果　報告用紙",null,null,null,null,null,"OFA 第 30 回 大分県ジュニアサッカー選手権大会",null,null,null,null,null,null,null,null,null,"予選リーグ結果　報告用紙"]
[]
["会場","大分県大分スポーツ公園　だいぎんサッカー・ラグビー場　A　北側",null,null,null,null,null,null,null,null,null,null,null,null,null,null,null,"会場","大分県大分スポーツ公園　だいぎんサッカー・ラグビー場　A　北側"]
[]
[null,null,null,null,"A1","竹田直入ＦＣ",null,null,null,null,null,null,"豊肥",null,null,null,null,null,null,null,"C1","ＭＳＳ",null,null,null,null,null,null,"大分"]
[null,null,null,null,"A2","大道サッカースポーツ少年団",null,null,null,null,null,null,"大分",null,null,null,null,null,null,null,"C2","由布川サッカースポーツ少年団",null,null,null,null,null,null,"大分"]
[null,null,null,null,"A3","臼杵ＳＳＳ",null,null,null,null,null,null,"臼杵",null,null,null,null,null,null,null,"C3","鶴居ＳＳＳ",null,null,null,null,null,null,"中津"]
[]
[]
["MC","仲野　昭博",null,null,"10:00:00","竹田直入ＦＣ",1,"（",0,"前半",1,"）",4,"大道サッカースポーツ少年団",null,null,"MC","安東　信二",null,null,"10:40:00","ＭＳＳ",2,"（",1,"前半",0,"）",0,"由布川サッカースポーツ少年団"]
["Welfare\nOfficer",null,null,null,null,null,null,null,1,"後半",3,null,null,null,null,null,"Welfare\nOfficer",null,null,null,null,null,null,null,1,"後半",0]
["記録","隅田　哲平",null,null,null,null,null,null,null,"PK",null,null,null,null,null,null,"記録","仲野　昭博",null,null,null,null,null,null,null,"PK"]
["＜Referee＞",null,null,null,"警告/退場\n選択肢より","氏名","番号","分","内容\n選択肢より",null,"内容\n選択肢より","分","番号","氏名","警告/退場\n選択肢より",null,"＜Referee＞",null,null,null,"警告/退場\n選択肢より","氏名","番号","分","内容\n選択肢より",null,"内容\n選択肢より","分","番号","氏名","警告/退場\n選択肢より"]
[null,null,null,null,"得点者","",null,null,null,null,null,null,null,"",null,null,null,null,null,null,"得点者","",null,null,null,null,null,null,null,""]
[null,null,null,null,"得点者","",null,null,null,null,null,null,null,"",null,null,null,null,null,null,"得点者","",null,null,null,null,null,null,null,""]
[null,null,null,null,"得点者","",null,null,null,null,null,null,null,"",null,null,null,null,null,null,"得点者","",null,null,null,null,null,null,null,""]
[null,null,null,null,"得点者","",null,null,null,null,null,null,null,"",null,null,null,null,null,null,"得点者","",null,null,null,null,null,null,null,""]
[null,null,null,null,"得点者","",null,null,null,null,null,null,null,"",null,null,null,null,null,null,"得点者","",null,null,null,null,null,null,null,""]
[null,null,null,null,"得点者","",null,null,null,null,null,null,null,"",null,null,null,null,null,null,"得点者","",null,null,null,null,null,null,null,""]
[null,null,null,null,"得点者","",null,null,null,null,null,null,null,"",null,null,null,null,null,null,"得点者","",null,null,null,null,null,null,null,""]
[null,null,null,null,"得点者","",null,null,null,null,null,null,null,"",null,null,null,null,null,null,"得点者","",null,null,null,null,null,null,null,""]
[null,null,null,null,"得点者","",null,null,null,null,null,null,null,"",null,null,null,null,null,null,"得点者","",null,null,null,null,null,null,null,""]
[null,null,null,null,"得点者","",null,null,null,null,null,null,null,"",null,null,null,null,null,null,"得点者","",null,null,null,null,null,null,null,""]
["番号","R010247516",null,null,null,"",null,null,null,null,null,null,null,"",null,null,"番号","R003677131",null,null,null,"",null,null,null,null,null,null,null,""]
["R","草場　帆斗",null,"3級",null,"",null,null,null,null,null,null,null,"",null,null,"R","久保　雅敬",null,"3級",null,"",null,null,null,null,null,null,null,""]
["番号","R004385495",null,null,null,"",null,null,null,null,null,null,null,"",null,null,"番号","R001264304",null,null,null,"",null,null,null,null,null,null,null,""]
["AR1:","宮崎　隆史",null,"3級",null,"",null,null,null,null,null,null,null,"",null,null,"AR1:","羽田野　亘",null,"3級",null,"",null,null,null,null,null,null,null,""]
["番号","R009197691",null,null,null,"",null,null,null,null,null,null,null,"",null,null,"番号","R006203593",null,null,null,"",null,null,null,null,null,null,null,""]
["AR2:","深堀　祥司",null,"3級",null,"",null,null,null,null,null,null,null,"",null,null,"AR2:","高島　秀樹",null,"3級",null,"",null,null,null,null,null,null,null,""]
["番号","R010255152",null,null,null,"",null,null,null,null,null,null,null,"",null,null,"番号","R010247516",null,null,null,"",null,null,null,null,null,null,null,""]
["4th:","菊池　芳郎",null,"3級",null,"",null,null,null,null,null,null,null,"",null,null,"4th:","草場　帆斗",null,"3級",null,"",null,null,null,null,null,null,null,""]
[]
[]
[]
[]
[]
[]
[]
["MC","牧　哲也",null,null,"11:20:00","大道サッカースポーツ少年団",10,"（",4,"前半",0,"）",0,"臼杵ＳＳＳ",null,null,"MC","仲野　昭博",null,null,"12:00:00","由布川サッカースポーツ少年団",2,"（",2,"前半",0,"）",1,"鶴居ＳＳＳ"]
["Welfare\nOfficer",null,null,null,null,null,null,null,6,"後半",0,null,null,null,null,null,"Welfare\nOfficer",null,null,null,null,null,null,null,0,"後半",1]
["記録","伊東　雅弘",null,null,null,null,null,null,null,"PK",null,null,null,null,null,null,"記録","隅田　哲平",null,null,null,null,null,null,null,"PK"]
["＜Referee＞",null,null,null,"警告/退場\n選択肢より","氏名","番号","分","内容\n選択肢より",null,"内容\n選択肢より","分","番号","氏名","警告/退場\n選択肢より",null,"＜Referee＞",null,null,null,"警告/退場\n選択肢より","氏名","番号","分","内容\n選択肢より",null,"内容\n選択肢より","分","番号","氏名","警告/退場\n選択肢より"]
[null,null,null,null,"得点者","",null,null,null,null,null,null,null,"",null,null,null,null,null,null,"得点者","",null,null,null,null,null,null,null,""]
[null,null,null,null,"得点者","",null,null,null,null,null,null,null,"",null,null,null,null,null,null,"得点者","",null,null,null,null,null,null,null,""]
[null,null,null,null,"得点者","",null,null,null,null,null,null,null,"",null,null,null,null,null,null,"得点者","",null,null,null,null,null,null,null,""]
[null,null,null,null,"得点者","",null,null,null,null,null,null,null,"",null,null,null,null,null,null,"得点者","",null,null,null,null,null,null,null,""]
[null,null,null,null,"得点者","",null,null,null,null,null,null,null,"",null,null,null,null,null,null,"得点者","",null,null,null,null,null,null,null,""]
[null,null,null,null,"得点者","",null,null,null,null,null,null,null,"",null,null,null,null,null,null,"得点者","",null,null,null,null,null,null,null,""]
[null,null,null,null,"得点者","",null,null,null,null,null,null,null,"",null,null,null,null,null,null,"得点者","",null,null,null,null,null,null,null,""]
[null,null,null,null,"得点者","",null,null,null,null,null,null,null,"",null,null,null,null,null,null,"得点者","",null,null,null,null,null,null,null,""]
[null,null,null,null,"得点者","",null,null,null,null,null,null,null,"",null,null,null,null,null,null,"得点者","",null,null,null,null,null,null,null,""]
[null,null,null,null,"得点者","",null,null,null,null,null,null,null,"",null,null,null,null,null,null,"得点者","",null,null,null,null,null,null,null,""]
["番号","R010255152",null,null,null,"",null,null,null,null,null,null,null,"",null,null,"番号","R010247516",null,null,null,"",null,null,null,null,null,null,null,""]
["R","菊池　芳郎",null,"3級",null,"",null,null,null,null,null,null,null,"",null,null,"R","草場　帆斗",null,"3級",null,"",null,null,null,null,null,null,null,""]
["番号","R009197691",null,null,null,"",null,null,null,null,null,null,null,"",null,null,"番号","R006203593",null,null,null,"",null,null,null,null,null,null,null,""]
["AR1:","深堀　祥司",null,"3級",null,"",null,null,null,null,null,null,null,"",null,null,"AR1:","高島　秀樹",null,"3級",null,"",null,null,null,null,null,null,null,""]
["番号","R003972230",null,null,null,"",null,null,null,null,null,null,null,"",null,null,"番号","R010069871",null,null,null,"",null,null,null,null,null,null,null,""]
["AR2:","戸田　清",null,"3級",null,"",null,null,null,null,null,null,null,"",null,null,"AR2:","足立　卓也",null,"3級",null,"",null,null,null,null,null,null,null,""]
["番号","R003677131",null,null,null,"",null,null,null,null,null,null,null,"",null,null,"番号","R010255152",null,null,null,"",null,null,null,null,null,null,null,""]
["4th:","久保　雅敬",null,"3級",null,"",null,null,null,null,null,null,null,"",null,null,"4th:","菊池　芳郎",null,"3級",null,"",null,null,null,null,null,null,null,""]
[]
[]
[]
[]
[]
[]
[]
["MC","牧　哲也",null,null,"13:20:00","臼杵ＳＳＳ",1,"（",1,"前半",3,"）",6,"竹田直入ＦＣ",null,null,"MC","毛藤　勇三",null,null,"14:00:00","鶴居ＳＳＳ",2,"（",1,"前半",4,"）",6,"ＭＳＳ"]
["Welfare\nOfficer",null,null,null,null,null,null,null,0,"後半",3,null,null,null,null,null,"Welfare\nOfficer",null,null,null,null,null,null,null,1,"後半",2]
["記録","仲野　昭博",null,null,null,null,null,null,null,"PK",null,null,null,null,null,null,"記録","笠野　わかこ",null,null,null,null,null,null,null,"PK"]
["＜Referee＞",null,null,null,"警告/退場\n選択肢より","氏名","番号","分","内容\n選択肢より",null,"内容\n選択肢より","分","番号","氏名","警告/退場\n選択肢より",null,"＜Referee＞",null,null,null,"警告/退場\n選択肢より","氏名","番号","分","内容\n選択肢より",null,"内容\n選択肢より","分","番号","氏名","警告/退場\n選択肢より"]
[null,null,null,null,"得点者","",null,null,null,null,null,null,null,"",null,null,null,null,null,null,"得点者","",null,null,null,null,null,null,null,""]
[null,null,null,null,"得点者","",null,null,null,null,null,null,null,"",null,null,null,null,null,null,"得点者","",null,null,null,null,null,null,null,""]
[null,null,null,null,"得点者","",null,null,null,null,null,null,null,"",null,null,null,null,null,null,"得点者","",null,null,null,null,null,null,null,""]
[null,null,null,null,"得点者","",null,null,null,null,null,null,null,"",null,null,null,null,null,null,"得点者","",null,null,null,null,null,null,null,""]
[null,null,null,null,"得点者","",null,null,null,null,null,null,null,"",null,null,null,null,null,null,"得点者","",null,null,null,null,null,null,null,""]
[null,null,null,null,"得点者","",null,null,null,null,null,null,null,"",null,null,null,null,null,null,"得点者","",null,null,null,null,null,null,null,""]
[null,null,null,null,"得点者","",null,null,null,null,null,null,null,"",null,null,null,null,null,null,"得点者","",null,null,null,null,null,null,null,""]
[null,null,null,null,"得点者","",null,null,null,null,null,null,null,"",null,null,null,null,null,null,"得点者","",null,null,null,null,null,null,null,""]
[null,null,null,null,"得点者","",null,null,null,null,null,null,null,"",null,null,null,null,null,null,"得点者","",null,null,null,null,null,null,null,""]
[null,null,null,null,"得点者","",null,null,null,null,null,null,null,"",null,null,null,null,null,null,"得点者","",null,null,null,null,null,null,null,""]
["番号","R003677131",null,null,null,"",null,null,null,null,null,null,null,"",null,null,"番号","R010255152",null,null,null,"",null,null,null,null,null,null,null,""]
["R","久保　雅敬",null,"3級",null,"",null,null,null,null,null,null,null,"",null,null,"R","菊池　芳郎",null,"3級",null,"",null,null,null,null,null,null,null,""]
["番号","R003972230",null,null,null,"",null,null,null,null,null,null,null,"",null,null,"番号","R010069871",null,null,null,"",null,null,null,null,null,null,null,""]
["AR1:","戸田　清",null,"3級",null,"",null,null,null,null,null,null,null,"",null,null,"AR1:","足立　卓也",null,"3級",null,"",null,null,null,null,null,null,null,""]
["番号","R004385495",null,null,null,"",null,null,null,null,null,null,null,"",null,null,"番号","R003256053",null,null,null,"",null,null,null,null,null,null,null,""]
["AR2:","宮崎　隆史",null,"3級",null,"",null,null,null,null,null,null,null,"",null,null,"AR2:","菊地　謙一",null,"3級",null,"",null,null,null,null,null,null,null,""]
["番号","R010247516",null,null,null,"",null,null,null,null,null,null,null,"",null,null,"番号","R003677131",null,null,null,"",null,null,null,null,null,null,null,""]
["4th:","草場　帆斗",null,"3級",null,"",null,null,null,null,null,null,null,"",null,null,"4th:","久保　雅敬",null,"3級",null,"",null,null,null,null,null,null,null,""]

{"sheet":"予選リーグ公式記録(A南)","index":9,"n_rows":89,"n_cols":31,"rows_kept":89,"cut":false,"hidden":false,"merged":[[9,30,11,30],[38,30,40,30],[67,30,69,30],[12,0,12,3],[12,16,12,19],[41,0,41,3],[41,16,41,19],[53,1,53,2],[53,17,53,18],[54,1,54,3],[54,17,54,19],[55,1,55,2],[55,17,55,18],[28,1,28,2],[28,17,28,18],[67,29,69,29],[67,23,69,23],[67,27,69,27],[67,28,69,28],[26,1,26,2],[26,17,26,18],[56,1,56,3],[56,17,56,19],[59,1,59,2],[59,17,59,18],[57,1,57,2],[57,17,57,18],[58,1,58,3],[58,17,58,19],[9,14,11,14],[38,14,40,14],[87,1,87,3],[87,17,87,19],[27,1,27,3],[27,17,27,19],[10,1,10,3],[11,1,11,3],[10,17,10,19],[11,17,11,19],[9,1,9,3],[9,17,9,19],[88,1,88,2],[88,17,88,18],[84,1,84,2],[84,17,84,18],[85,1,85,3],[85,17,85,19],[86,1,86,2],[86,17,86,18],[81,1,81,3],[81,17,81,19],[82,1,82,2],[82,17,82,18],[83,1,83,3],[83,17,83,19],[67,20,69,20],[67,21,69,21],[67,22,69,22],[67,4,69,4],[67,5,69,5],[67,6,69,6],[67,7,69,7],[67,11,69,11],[70,0,70,3],[70,16,70,19],[67,12,69,12],[67,13,69,13],[67,14,69,14],[68,1,68,3],[69,1,69,3],[68,17,68,19],[69,17,69,19],[67,1,67,3],[67,17,67,19],[38,23,40,23],[38,27,40,27],[38,28,40,28],[38,29,40,29],[52,1,52,3],[52,17,52,19],[38,5,40,5],[38,6,40,6],[38,7,40,7],[38,11,40,11],[38,12,40,12],[38,13,40,13],[38,22,40,22],[39,17,39,19],[40,17,40,19],[39,1,39,3],[40,1,40,3],[38,1,38,3],[38,17,38,19],[9,27,11,27],[9,28,11,28],[9,29,11,29],[9,22,11,22],[5,21,5,27],[6,21,6,27],[4,28,4,29],[5,28,5,29],[6,28,6,29],[9,23,11,23],[4,12,4,13],[4,5,4,11],[5,5,5,11],[5,12,5,13],[4,21,4,27],[0,0,0,9],[0,10,0,13],[0,16,0,25],[0,26,0,29],[6,5,6,11],[23,1,23,3],[24,1,24,2],[38,20,40,20],[38,21,40,21],[9,7,11,7],[9,11,11,11],[9,4,11,4],[9,5,11,5],[23,17,23,19],[9,6,11,6],[38,4,40,4],[9,20,11,20],[9,21,11,21],[6,12,6,13],[9,12,11,12],[9,13,11,13],[24,17,24,18],[29,1,29,3],[29,17,29,19],[30,1,30,2],[30,17,30,18],[25,1,25,3],[25,17,25,19]]}
["OFA 第 30 回 大分県ジュニアサッカー選手権大会",null,null,null,null,null,null,null,null,null,"予選リーグ結果　報告用紙",null,null,null,null,null,"OFA 第 30 回 大分県ジュニアサッカー選手権大会",null,null,null,null,null,null,null,null,null,"予選リーグ結果　報告用紙"]
[]
["会場","大分県大分スポーツ公園　だいぎんサッカー・ラグビー場　A　南側",null,null,null,null,null,null,null,null,null,null,null,null,null,null,null,"会場","大分県大分スポーツ公園　だいぎんサッカー・ラグビー場　A　南側"]
[]
[null,null,null,null,"B1","八坂少年サッカークラブ",null,null,null,null,null,null,"速杵国東",null,null,null,null,null,null,null,"D1","大分トリニータＵ－１２",null,null,null,null,null,null,"大分"]
[null,null,null,null,"B2","宗方サッカークラブ",null,null,null,null,null,null,"大分",null,null,null,null,null,null,null,"D2","ブルーウイングフットボールクラブ",null,null,null,null,null,null,"大分"]
[null,null,null,null,"B3","太陽スポーツクラブ大分西",null,null,null,null,null,null,"日田",null,null,null,null,null,null,null,"D3","ＦＣ　ＷＡＹＳ",null,null,null,null,null,null,"宇佐高田"]
[]
[]
["MC","津守　一雄",null,null,"10:00:00","八坂少年サッカークラブ",2,"（",1,"前半",1,"）",1,"宗方サッカークラブ",null,null,"MC","中原　圭介",null,null,"10:40:00","大分トリニータＵ－１２",2,"（",0,"前半",0,"）",0,"ブルーウイングフットボールクラブ"]
["Welfare\nOfficer",null,null,null,null,null,null,null,1,"後半",0,null,null,null,null,null,"Welfare\nOfficer",null,null,null,null,null,null,null,2,"後半",0]
["記録","中野　観司郎",null,null,null,null,null,null,null,"PK",null,null,null,null,null,null,"記録","津守　一雄",null,null,null,null,null,null,null,"PK"]
["＜Referee＞",null,null,null,"警告/退場\n選択肢より","氏名","番号","分","内容\n選択肢より",null,"内容\n選択肢より","分","番号","氏名","警告/退場\n選択肢より",null,"＜Referee＞",null,null,null,"警告/退場\n選択肢より","氏名","番号","分","内容\n選択肢より",null,"内容\n選択肢より","分","番号","氏名","警告/退場\n選択肢より"]
[null,null,null,null,"得点者","",null,null,null,null,null,null,null,"",null,null,null,null,null,null,"得点者","",null,null,null,null,null,5,10,"奈良　三志朗"]
[null,null,null,null,"得点者","",null,null,null,null,null,null,null,"",null,null,null,null,null,null,"得点者","",null,null,null,null,null,null,null,""]
[null,null,null,null,"得点者","",null,null,null,null,null,null,null,"",null,null,null,null,null,null,"得点者","",null,null,null,null,null,null,null,""]
[null,null,null,null,"得点者","",null,null,null,null,null,null,null,"",null,null,null,null,null,null,"得点者","",null,null,null,null,null,null,null,""]
[null,null,null,null,"得点者","",null,null,null,null,null,null,null,"",null,null,null,null,null,null,"得点者","",null,null,null,null,null,null,null,""]
[null,null,null,null,"得点者","",null,null,null,null,null,null,null,"",null,null,null,null,null,null,"得点者","",null,null,null,null,null,null,null,""]
[null,null,null,null,"得点者","",null,null,null,null,null,null,null,"",null,null,null,null,null,null,"得点者","",null,null,null,null,null,null,null,""]
[null,null,null,null,"得点者","",null,null,null,null,null,null,null,"",null,null,null,null,null,null,"得点者","",null,null,null,null,null,null,null,""]
[null,null,null,null,"得点者","",null,null,null,null,null,null,null,"",null,null,null,null,null,null,"得点者","",null,null,null,null,null,null,null,""]
[null,null,null,null,"得点者","",null,null,null,null,null,null,null,"",null,null,null,null,null,null,"得点者","",null,null,null,null,null,null,null,""]
["番号","R009546055",null,null,null,"",null,null,null,null,null,null,null,"",null,null,"番号","R006664961",null,null,null,"",null,null,null,null,null,null,null,""]
["R","吐合　直樹",null,"3級",null,"",null,null,null,null,null,null,null,"",null,null,"R","末吉　裕樹",null,"3級",null,"",null,null,null,null,null,null,null,""]
["番号","R010044664",null,null,null,"",null,null,null,null,null,null,null,"",null,null,"番号","R010027860",null,null,null,"",null,null,null,null,null,null,null,""]
["AR1:","穴井　裕大",null,"3級",null,"",null,null,null,null,null,null,null,"",null,null,"AR1:","藤原　佑史朗",null,"3級",null,"",null,null,null,null,null,null,null,""]
["番号","R007075261",null,null,null,"",null,null,null,null,null,null,null,"",null,null,"番号","R010027843",null,null,null,"",null,null,null,null,null,null,null,""]
["AR2:","小川　翔太",null,"3級",null,"",null,null,null,null,null,null,null,"",null,null,"AR2:","姫野　孝太",null,"3級",null,"",null,null,null,null,null,null,null,""]
["番号","R003972443",null,null,null,"",null,null,null,null,null,null,null,"",null,null,"番号","R009546055",null,null,null,"",null,null,null,null,null,null,null,""]
["4th:","矢野　三千生",null,"3級",null,"",null,null,null,null,null,null,null,"",null,null,"4th:","吐合　直樹",null,"3級",null,"",null,null,null,null,null,null,null,""]
[]
[]
[]
[]
[]
[]
[]
["MC","中野　観司郎",null,null,"11:20:00","宗方サッカークラブ",2,"（",2,"前半",0,"）",0,"太陽スポーツクラブ大分西",null,null,"MC","津守　一雄",null,null,"12:00:00","ブルーウイングフットボールクラブ",6,"（",2,"前半",1,"）",1,"ＦＣ　ＷＡＹＳ"]
["Welfare\nOfficer",null,null,null,null,null,null,null,0,"後半",0,null,null,null,null,null,"Welfare\nOfficer",null,null,null,null,null,null,null,4,"後半",0]
["記録","中原　圭介",null,null,null,null,null,null,null,"PK",null,null,null,null,null,null,"記録","中野　観司郎",null,null,null,null,null,null,null,"PK"]
["＜Referee＞",null,null,null,"警告/退場\n選択肢より","氏名","番号","分","内容\n選択肢より",null,"内容\n選択肢より","分","番号","氏名","警告/退場\n選択肢より",null,"＜Referee＞",null,null,null,"警告/退場\n選択肢より","氏名","番号","分","内容\n選択肢より",null,"内容\n選択肢より","分","番号","氏名","警告/退場\n選択肢より"]
[null,null,null,null,"得点者","",null,null,null,null,null,null,null,"",null,null,null,null,null,null,"得点者","",null,null,null,null,null,null,null,""]
[null,null,null,null,"得点者","",null,null,null,null,null,null,null,"",null,null,null,null,null,null,"得点者","",null,null,null,null,null,null,null,""]
[null,null,null,null,"得点者","",null,null,null,null,null,null,null,"",null,null,null,null,null,null,"得点者","",null,null,null,null,null,null,null,""]
[null,null,null,null,"得点者","",null,null,null,null,null,null,null,"",null,null,null,null,null,null,"得点者","",null,null,null,null,null,null,null,""]
[null,null,null,null,"得点者","",null,null,null,null,null,null,null,"",null,null,null,null,null,null,"得点者","",null,null,null,null,null,null,null,""]
[null,null,null,null,"得点者","",null,null,null,null,null,null,null,"",null,null,null,null,null,null,"得点者","",null,null,null,null,null,null,null,""]
[null,null,null,null,"得点者","",null,null,null,null,null,null,null,"",null,null,null,null,null,null,"得点者","",null,null,null,null,null,null,null,""]
[null,null,null,null,"得点者","",null,null,null,null,null,null,null,"",null,null,null,null,null,null,"得点者","",null,null,null,null,null,null,null,""]
[null,null,null,null,"得点者","",null,null,null,null,null,null,null,"",null,null,null,null,null,null,"得点者","",null,null,null,null,null,null,null,""]
[null,null,null,null,"得点者","",null,null,null,null,null,null,null,"",null,null,null,null,null,null,"得点者","",null,null,null,null,null,null,null,""]
["番号","R003972443",null,null,null,"",null,null,null,null,null,null,null,"",null,null,"番号","R009546055",null,null,null,"",null,null,null,null,null,null,null,""]
["R","矢野　三千生",null,"3級",null,"",null,null,null,null,null,null,null,"",null,null,"R","吐合　直樹",null,"3級",null,"",null,null,null,null,null,null,null,""]
["番号","R007075261",null,null,null,"",null,null,null,null,null,null,null,"",null,null,"番号","R010027843",null,null,null,"",null,null,null,null,null,null,null,""]
["AR1:","小川　翔太",null,"3級",null,"",null,null,null,null,null,null,null,"",null,null,"AR1:","姫野　孝太",null,"3級",null,"",null,null,null,null,null,null,null,""]
["番号","R004225713",null,null,null,"",null,null,null,null,null,null,null,"",null,null,"番号","R004060170",null,null,null,"",null,null,null,null,null,null,null,""]
["AR2:","有田　裕哉",null,"3級",null,"",null,null,null,null,null,null,null,"",null,null,"AR2:","立花　陽一郎",null,"3級",null,"",null,null,null,null,null,null,null,""]
["番号","R006664961",null,null,null,"",null,null,null,null,null,null,null,"",null,null,"番号","R003972443",null,null,null,"",null,null,null,null,null,null,null,""]
["4th:","末吉　裕樹",null,"3級",null,"",null,null,null,null,null,null,null,"",null,null,"4th:","矢野　三千生",null,"3級",null,"",null,null,null,null,null,null,null,""]
[]
[]
[]
[]
[]
[]
[]
["MC","中原　圭介",null,null,"13:20:00","太陽スポーツクラブ大分西",4,"（",3,"前半",0,"）",0,"八坂少年サッカークラブ",null,null,"MC","中野　観司郎",null,null,"14:00:00","ＦＣ　ＷＡＹＳ",0,"（",0,"前半",1,"）",4,"大分トリニータＵ－１２"]
["Welfare\nOfficer",null,null,null,null,null,null,null,1,"後半",0,null,null,null,null,null,"Welfare\nOfficer",null,null,null,null,null,null,null,0,"後半",3]
["記録","津守　一雄",null,null,null,null,null,null,null,"PK",null,null,null,null,null,null,"記録","中原　圭介",null,null,null,null,null,null,null,"PK"]
["＜Referee＞",null,null,null,"警告/退場\n選択肢より","氏名","番号","分","内容\n選択肢より",null,"内容\n選択肢より","分","番号","氏名","警告/退場\n選択肢より",null,"＜Referee＞",null,null,null,"警告/退場\n選択肢より","氏名","番号","分","内容\n選択肢より",null,"内容\n選択肢より","分","番号","氏名","警告/退場\n選択肢より"]
[null,null,null,null,"得点者","",null,null,null,null,null,19,9,"元木　漣",null,null,null,null,null,null,"得点者","",null,null,null,null,null,null,null,""]
[null,null,null,null,"得点者","",null,null,null,null,null,null,null,"",null,null,null,null,null,null,"得点者","",null,null,null,null,null,null,null,""]
[null,null,null,null,"得点者","",null,null,null,null,null,null,null,"",null,null,null,null,null,null,"得点者","",null,null,null,null,null,null,null,""]
[null,null,null,null,"得点者","",null,null,null,null,null,null,null,"",null,null,null,null,null,null,"得点者","",null,null,null,null,null,null,null,""]
[null,null,null,null,"得点者","",null,null,null,null,null,null,null,"",null,null,null,null,null,null,"得点者","",null,null,null,null,null,null,null,""]
[null,null,null,null,"得点者","",null,null,null,null,null,null,null,"",null,null,null,null,null,null,"得点者","",null,null,null,null,null,null,null,""]
[null,null,null,null,"得点者","",null,null,null,null,null,null,null,"",null,null,null,null,null,null,"得点者","",null,null,null,null,null,null,null,""]
[null,null,null,null,"得点者","",null,null,null,null,null,null,null,"",null,null,null,null,null,null,"得点者","",null,null,null,null,null,null,null,""]
[null,null,null,null,"得点者","",null,null,null,null,null,null,null,"",null,null,null,null,null,null,"得点者","",null,null,null,null,null,null,null,""]
[null,null,null,null,"得点者","",null,null,null,null,null,null,null,"",null,null,null,null,null,null,"得点者","",null,null,null,null,null,null,null,""]
["番号","R006664961",null,null,null,"",null,null,null,null,null,null,null,"",null,null,"番号","R003972443",null,null,null,"",null,null,null,null,null,null,null,""]
["R","末吉　裕樹",null,"3級",null,"",null,null,null,null,null,null,null,"",null,null,"R","矢野　三千生",null,"3級",null,"",null,null,null,null,null,null,null,""]
["番号","R004225713",null,null,null,"",null,null,null,null,null,null,null,"",null,null,"番号","R010027860",null,null,null,"",null,null,null,null,null,null,null,""]
["AR1:","有田　裕哉",null,"3級",null,"",null,null,null,null,null,null,null,"",null,null,"AR1:","藤原　佑史朗",null,"3級",null,"",null,null,null,null,null,null,null,""]
["番号","R010044664",null,null,null,"",null,null,null,null,null,null,null,"",null,null,"番号","R004060170",null,null,null,"",null,null,null,null,null,null,null,""]
["AR2:","穴井　裕大",null,"3級",null,"",null,null,null,null,null,null,null,"",null,null,"AR2:","立花　陽一郎",null,"3級",null,"",null,null,null,null,null,null,null,""]
["番号","R003350854",null,null,null,"",null,null,null,null,null,null,null,"",null,null,"番号","R006664961",null,null,null,"",null,null,null,null,null,null,null,""]
["4th:","毛藤　勇三",null,"3級",null,"",null,null,null,null,null,null,null,"",null,null,"4th:","末吉　裕樹",null,"3級",null,"",null,null,null,null,null,null,null,""]

{"sheet":"予選リーグ公式記録(B北)","index":10,"n_rows":89,"n_cols":31,"rows_kept":89,"cut":false,"hidden":false,"merged":[[9,30,11,30],[38,30,40,30],[67,30,69,30],[12,0,12,3],[12,16,12,19],[41,0,41,3],[41,16,41,19],[53,1,53,2],[53,17,53,18],[54,1,54,3],[54,17,54,19],[55,1,55,2],[55,17,55,18],[28,1,28,2],[28,17,28,18],[67,29,69,29],[67,23,69,23],[67,27,69,27],[67,28,69,28],[26,1,26,2],[26,17,26,18],[56,1,56,3],[56,17,56,19],[59,1,59,2],[59,17,59,18],[57,1,57,2],[57,17,57,18],[58,1,58,3],[58,17,58,19],[9,14,11,14],[38,14,40,14],[87,1,87,3],[87,17,87,19],[27,1,27,3],[27,17,27,19],[10,1,10,3],[11,1,11,3],[10,17,10,19],[11,17,11,19],[9,1,9,3],[9,17,9,19],[88,1,88,2],[88,17,88,18],[84,1,84,2],[84,17,84,18],[85,1,85,3],[85,17,85,19],[86,1,86,2],[86,17,86,18],[81,1,81,3],[81,17,81,19],[82,1,82,2],[82,17,82,18],[83,1,83,3],[83,17,83,19],[67,20,69,20],[67,21,69,21],[67,22,69,22],[67,4,69,4],[67,5,69,5],[67,6,69,6],[67,7,69,7],[67,11,69,11],[70,0,70,3],[70,16,70,19],[67,12,69,12],[67,13,69,13],[67,14,69,14],[68,1,68,3],[69,1,69,3],[68,17,68,19],[69,17,69,19],[67,1,67,3],[67,17,67,19],[38,23,40,23],[38,27,40,27],[38,28,40,28],[38,29,40,29],[52,1,52,3],[52,17,52,19],[38,5,40,5],[38,6,40,6],[38,7,40,7],[38,11,40,11],[38,12,40,12],[38,13,40,13],[38,22,40,22],[39,17,39,19],[40,17,40,19],[39,1,39,3],[40,1,40,3],[38,1,38,3],[38,17,38,19],[9,27,11,27],[9,28,11,28],[9,29,11,29],[9,22,11,22],[5,21,5,27],[6,21,6,27],[4,28,4,29],[5,28,5,29],[6,28,6,29],[9,23,11,23],[4,12,4,13],[4,5,4,11],[5,5,5,11],[5,12,5,13],[4,21,4,27],[0,0,0,9],[0,10,0,13],[0,16,0,25],[0,26,0,29],[6,5,6,11],[23,1,23,3],[24,1,24,2],[38,20,40,20],[38,21,40,21],[9,7,11,7],[9,11,11,11],[9,4,11,4],[9,5,11,5],[23,17,23,19],[9,6,11,6],[38,4,40,4],[9,20,11,20],[9,21,11,21],[6,12,6,13],[9,12,11,12],[9,13,11,13],[24,17,24,18],[29,1,29,3],[29,17,29,19],[30,1,30,2],[30,17,30,18],[25,1,25,3],[25,17,25,19]]}
["OFA 第 30 回 大分県ジュニアサッカー選手権大会",null,null,null,null,null,null,null,null,null,"予選リーグ結果　報告用紙",null,null,null,null,null,"OFA 第 30 回 大分県ジュニアサッカー選手権大会",null,null,null,null,null,null,null,null,null,"予選リーグ結果　報告用紙"]
[]
["会場","大分県大分スポーツ公園　だいぎんサッカー・ラグビー場　B　北側",null,null,null,null,null,null,null,null,null,null,null,null,null,null,null,"会場","大分県大分スポーツ公園　だいぎんサッカー・ラグビー場　B　北側"]
[]
[null,null,null,null,"E1","中津沖代ＪＳＣ",null,null,null,null,null,null,"中津",null,null,null,null,null,null,null,"G1","玖珠サッカースポーツ少年団",null,null,null,null,null,null,"日田"]
[null,null,null,null,"E2","ＫＩＮＧＳ　ＦＯＯＴＢＡＬＬＣＬＵＢ　Ｕ－１２　Ｂ",null,null,null,null,null,null,"大分",null,null,null,null,null,null,null,"G2","ドリームキッズサッカークラブ",null,null,null,null,null,null,"大分"]
[null,null,null,null,"E3","津久見サッカースポーツ少年団",null,null,null,null,null,null,"津久見",null,null,null,null,null,null,null,"G3","大平山アソシエーション式フットボールクラブ",null,null,null,null,null,null,"別府"]
[]
[]
["MC","市原　宗久",null,null,"10:00:00","中津沖代ＪＳＣ",2,"（",2,"前半",0,"）",0,"ＫＩＮＧＳ　ＦＯＯＴＢＡＬＬＣＬＵＢ　Ｕ－１２　Ｂ",null,null,"MC","松尾　章",null,null,"10:40:00","玖珠サッカースポーツ少年団",0,"（",0,"前半",3,"）",6,"ドリームキッズサッカークラブ"]
["Welfare\nOfficer",null,null,null,null,null,null,null,0,"後半",0,null,null,null,null,null,"Welfare\nOfficer",null,null,null,null,null,null,null,0,"後半",3]
["記録","秋吉　明",null,null,null,null,null,null,null,"PK",null,null,null,null,null,null,"記録","市原　宗久",null,null,null,null,null,null,null,"PK"]
["＜Referee＞",null,null,null,"警告/退場\n選択肢より","氏名","番号","分","内容\n選択肢より",null,"内容\n選択肢より","分","番号","氏名","警告/退場\n選択肢より",null,"＜Referee＞",null,null,null,"警告/退場\n選択肢より","氏名","番号","分","内容\n選択肢より",null,"内容\n選択肢より","分","番号","氏名","警告/退場\n選択肢より"]
[null,null,null,null,"得点者","",null,null,null,null,null,null,null,"",null,null,null,null,null,null,"得点者","",null,null,null,null,null,null,null,""]
[null,null,null,null,"得点者","",null,null,null,null,null,null,null,"",null,null,null,null,null,null,"得点者","",null,null,null,null,null,null,null,""]
[null,null,null,null,"得点者","",null,null,null,null,null,null,null,"",null,null,null,null,null,null,"得点者","",null,null,null,null,null,null,null,""]
[null,null,null,null,"得点者","",null,null,null,null,null,null,null,"",null,null,null,null,null,null,"得点者","",null,null,null,null,null,null,null,""]
[null,null,null,null,"得点者","",null,null,null,null,null,null,null,"",null,null,null,null,null,null,"得点者","",null,null,null,null,null,null,null,""]
[null,null,null,null,"得点者","",null,null,null,null,null,null,null,"",null,null,null,null,null,null,"得点者","",null,null,null,null,null,null,null,""]
[null,null,null,null,"得点者","",null,null,null,null,null,null,null,"",null,null,null,null,null,null,"得点者","",null,null,null,null,null,null,null,""]
[null,null,null,null,"得点者","",null,null,null,null,null,null,null,"",null,null,null,null,null,null,"得点者","",null,null,null,null,null,null,null,""]
[null,null,null,null,"得点者","",null,null,null,null,null,null,null,"",null,null,null,null,null,null,"得点者","",null,null,null,null,null,null,null,""]
[null,null,null,null,"得点者","",null,null,null,null,null,null,null,"",null,null,null,null,null,null,"得点者","",null,null,null,null,null,null,null,""]
["番号","R001262999",null,null,null,"",null,null,null,null,"反スポ",30,4,"平川　幹大","警告",null,"番号","R010093443",null,null,null,"",null,null,null,null,null,null,null,""]
["R","木原　一心",null,"2級",null,"",null,null,null,null,null,null,null,"",null,null,"R","内山田　光史",null,"3級",null,"",null,null,null,null,null,null,null,""]
["番号","R001262458",null,null,null,"",null,null,null,null,null,null,null,"",null,null,"番号","R001263785",null,null,null,"",null,null,null,null,null,null,null,""]
["AR1:","伊東　雅弘",null,"3級",null,"",null,null,null,null,null,null,null,"",null,null,"AR1:","高橋　芳洋",null,"3級",null,"",null,null,null,null,null,null,null,""]
["番号","R009408904",null,null,null,"",null,null,null,null,null,null,null,"",null,null,"番号","R001257340",null,null,null,"",null,null,null,null,null,null,null,""]
["AR2:","石井　洋平",null,"3級",null,"",null,null,null,null,null,null,null,"",null,null,"AR2:","篠田　公成",null,"3級",null,"",null,null,null,null,null,null,null,""]
["番号","R008798217",null,null,null,"",null,null,null,null,null,null,null,"",null,null,"番号","R001262999",null,null,null,"",null,null,null,null,null,null,null,""]
["4th:","藤本　勝爾",null,"3級",null,"",null,null,null,null,null,null,null,"",null,null,"4th:","木原　一心",null,"2級",null,"",null,null,null,null,null,null,null,""]
[]
[]
[]
[]
[]
[]
[]
["MC","秋吉　明",null,null,"11:20:00","ＫＩＮＧＳ　ＦＯＯＴＢＡＬＬＣＬＵＢ　Ｕ－１２　Ｂ",10,"（",5,"前半",0,"）",1,"津久見サッカースポーツ少年団",null,null,"MC","市原　宗久",null,null,"12:00:00","ドリームキッズサッカークラブ",1,"（",1,"前半",0,"）",0,"大平山アソシエーション式フットボールクラブ"]
["Welfare\nOfficer",null,null,null,null,null,null,null,5,"後半",1,null,null,null,null,null,"Welfare\nOfficer",null,null,null,null,null,null,null,0,"後半",0]
["記録","松尾　章",null,null,null,null,null,null,null,"PK",null,null,null,null,null,null,"記録","秋吉　明",null,null,null,null,null,null,null,"PK"]
["＜Referee＞",null,null,null,"警告/退場\n選択肢より","氏名","番号","分","内容\n選択肢より",null,"内容\n選択肢より","分","番号","氏名","警告/退場\n選択肢より",null,"＜Referee＞",null,null,null,"警告/退場\n選択肢より","氏名","番号","分","内容\n選択肢より",null,"内容\n選択肢より","分","番号","氏名","警告/退場\n選択肢より"]
[null,null,null,null,"得点者","",null,null,null,null,null,null,null,"",null,null,null,null,null,null,"得点者","",null,null,null,null,null,null,null,""]
[null,null,null,null,"得点者","",null,null,null,null,null,null,null,"",null,null,null,null,null,null,"得点者","",null,null,null,null,null,null,null,""]
[null,null,null,null,"得点者","",null,null,null,null,null,null,null,"",null,null,null,null,null,null,"得点者","",null,null,null,null,null,null,null,""]
[null,null,null,null,"得点者","",null,null,null,null,null,null,null,"",null,null,null,null,null,null,"得点者","",null,null,null,null,null,null,null,""]
[null,null,null,null,"得点者","",null,null,null,null,null,null,null,"",null,null,null,null,null,null,"得点者","",null,null,null,null,null,null,null,""]
[null,null,null,null,"得点者","",null,null,null,null,null,null,null,"",null,null,null,null,null,null,"得点者","",null,null,null,null,null,null,null,""]
[null,null,null,null,"得点者","",null,null,null,null,null,null,null,"",null,null,null,null,null,null,"得点者","",null,null,null,null,null,null,null,""]
[null,null,null,null,"得点者","",null,null,null,null,null,null,null,"",null,null,null,null,null,null,"得点者","",null,null,null,null,null,null,null,""]
[null,null,null,null,"得点者","",null,null,null,null,null,null,null,"",null,null,null,null,null,null,"得点者","",null,null,null,null,null,null,null,""]
[null,null,null,null,"得点者","",null,null,null,null,null,null,null,"",null,null,null,null,null,null,"得点者","",null,null,null,null,null,null,null,""]
["番号","R008798217",null,null,null,"",null,null,null,null,null,null,null,"",null,null,"番号","R001262999",null,null,null,"",null,null,null,null,null,null,null,""]
["R","藤本　勝爾",null,"3級",null,"",null,null,null,null,null,null,null,"",null,null,"R","木原　一心",null,"2級",null,"",null,null,null,null,null,null,null,""]
["番号","R009408904",null,null,null,"",null,null,null,null,null,null,null,"",null,null,"番号","R001257340",null,null,null,"",null,null,null,null,null,null,null,""]
["AR1:","石井　洋平",null,"3級",null,"",null,null,null,null,null,null,null,"",null,null,"AR1:","篠田　公成",null,"3級",null,"",null,null,null,null,null,null,null,""]
["番号","R001263350",null,null,null,"",null,null,null,null,null,null,null,"",null,null,"番号","R008798305",null,null,null,"",null,null,null,null,null,null,null,""]
["AR2:","酒井　祐三",null,"3級",null,"",null,null,null,null,null,null,null,"",null,null,"AR2:","染矢　恭明",null,"3級",null,"",null,null,null,null,null,null,null,""]
["番号","R010093443",null,null,null,"",null,null,null,null,null,null,null,"",null,null,"番号","R008798217",null,null,null,"",null,null,null,null,null,null,null,""]
["4th:","内山田　光史",null,"3級",null,"",null,null,null,null,null,null,null,"",null,null,"4th:","藤本　勝爾",null,"3級",null,"",null,null,null,null,null,null,null,""]
[]
[]
[]
[]
[]
[]
[]
["MC","松尾　章",null,null,"13:20:00","津久見サッカースポーツ少年団",0,"（",0,"前半",3,"）",4,"中津沖代ＪＳＣ",null,null,"MC","秋吉　明",null,null,"14:00:00","大平山アソシエーション式フットボールクラブ",0,"（",0,"前半",0,"）",0,"玖珠サッカースポーツ少年団"]
["Welfare\nOfficer",null,null,null,null,null,null,null,0,"後半",1,null,null,null,null,null,"Welfare\nOfficer",null,null,null,null,null,null,null,0,"後半",0]
["記録","市原　宗久",null,null,null,null,null,null,null,"PK",null,null,null,null,null,null,"記録","松尾　章",null,null,null,null,null,null,null,"PK"]
["＜Referee＞",null,null,null,"警告/退場\n選択肢より","氏名","番号","分","内容\n選択肢より",null,"内容\n選択肢より","分","番号","氏名","警告/退場\n選択肢より",null,"＜Referee＞",null,null,null,"警告/退場\n選択肢より","氏名","番号","分","内容\n選択肢より",null,"内容\n選択肢より","分","番号","氏名","警告/退場\n選択肢より"]
[null,null,null,null,"得点者","",null,null,null,null,null,null,null,"",null,null,null,null,null,null,"得点者","",null,null,null,null,null,null,null,""]
[null,null,null,null,"得点者","",null,null,null,null,null,null,null,"",null,null,null,null,null,null,"得点者","",null,null,null,null,null,null,null,""]
[null,null,null,null,"得点者","",null,null,null,null,null,null,null,"",null,null,null,null,null,null,"得点者","",null,null,null,null,null,null,null,""]
[null,null,null,null,"得点者","",null,null,null,null,null,null,null,"",null,null,null,null,null,null,"得点者","",null,null,null,null,null,null,null,""]
[null,null,null,null,"得点者","",null,null,null,null,null,null,null,"",null,null,null,null,null,null,"得点者","",null,null,null,null,null,null,null,""]
[null,null,null,null,"得点者","",null,null,null,null,null,null,null,"",null,null,null,null,null,null,"得点者","",null,null,null,null,null,null,null,""]
[null,null,null,null,"得点者","",null,null,null,null,null,null,null,"",null,null,null,null,null,null,"得点者","",null,null,null,null,null,null,null,""]
[null,null,null,null,"得点者","",null,null,null,null,null,null,null,"",null,null,null,null,null,null,"得点者","",null,null,null,null,null,null,null,""]
[null,null,null,null,"得点者","",null,null,null,null,null,null,null,"",null,null,null,null,null,null,"得点者","",null,null,null,null,null,null,null,""]
[null,null,null,null,"得点者","",null,null,null,null,null,null,null,"",null,null,null,null,null,null,"得点者","",null,null,null,null,null,null,null,""]
["番号","R010093443",null,null,null,"",null,null,null,null,null,null,null,"",null,null,"番号","R008798217",null,null,null,"",null,null,null,null,null,null,null,""]
["R","内山田　光史",null,"3級",null,"",null,null,null,null,null,null,null,"",null,null,"R","藤本　勝爾",null,"3級",null,"",null,null,null,null,null,null,null,""]
["番号","R001263350",null,null,null,"",null,null,null,null,null,null,null,"",null,null,"番号","R001263785",null,null,null,"",null,null,null,null,null,null,null,""]
["AR1:","酒井　祐三",null,"3級",null,"",null,null,null,null,null,null,null,"",null,null,"AR1:","高橋　芳洋",null,"3級",null,"",null,null,null,null,null,null,null,""]
["番号","R001262458",null,null,null,"",null,null,null,null,null,null,null,"",null,null,"番号","R008798305",null,null,null,"",null,null,null,null,null,null,null,""]
["AR2:","伊東　雅弘",null,"3級",null,"",null,null,null,null,null,null,null,"",null,null,"AR2:","染矢　恭明",null,"3級",null,"",null,null,null,null,null,null,null,""]
["番号","R001262999",null,null,null,"",null,null,null,null,null,null,null,"",null,null,"番号","R010093443",null,null,null,"",null,null,null,null,null,null,null,""]
["4th:","木原　一心",null,"2級",null,"",null,null,null,null,null,null,null,"",null,null,"4th:","内山田　光史",null,"3級",null,"",null,null,null,null,null,null,null,""]

{"sheet":"予選リーグ公式記録(B南)","index":11,"n_rows":89,"n_cols":31,"rows_kept":89,"cut":false,"hidden":false,"merged":[[9,30,11,30],[38,30,40,30],[67,30,69,30],[0,0,0,9],[0,10,0,13],[0,16,0,25],[0,26,0,29],[12,0,12,3],[12,16,12,19],[41,0,41,3],[41,16,41,19],[54,1,54,3],[54,17,54,19],[55,1,55,2],[55,17,55,18],[56,1,56,3],[56,17,56,19],[38,28,40,28],[38,29,40,29],[52,1,52,3],[52,17,52,19],[57,1,57,2],[57,17,57,18],[58,1,58,3],[67,29,69,29],[67,27,69,27],[59,1,59,2],[59,17,59,18],[67,14,69,14],[86,1,86,2],[86,17,86,18],[81,1,81,3],[81,17,81,19],[82,1,82,2],[82,17,82,18],[67,13,69,13],[67,20,69,20],[67,21,69,21],[67,22,69,22],[67,23,69,23],[67,4,69,4],[67,5,69,5],[67,6,69,6],[67,7,69,7],[67,11,69,11],[67,12,69,12],[70,0,70,3],[88,1,88,2],[88,17,88,18],[83,1,83,3],[83,17,83,19],[84,1,84,2],[84,17,84,18],[85,1,85,3],[85,17,85,19],[67,28,69,28],[29,1,29,3],[29,17,29,19],[23,1,23,3],[24,1,24,2],[25,1,25,3],[28,1,28,2],[28,17,28,18],[9,4,11,4],[87,1,87,3],[87,17,87,19],[70,16,70,19],[58,17,58,19],[53,1,53,2],[53,17,53,18],[68,1,68,3],[69,1,69,3],[68,17,68,19],[69,17,69,19],[67,1,67,3],[67,17,67,19],[9,11,11,11],[26,1,26,2],[26,17,26,18],[27,1,27,3],[38,23,40,23],[38,27,40,27],[30,1,30,2],[30,17,30,18],[38,4,40,4],[38,5,40,5],[38,6,40,6],[38,7,40,7],[38,14,40,14],[38,11,40,11],[38,12,40,12],[38,13,40,13],[38,20,40,20],[39,17,39,19],[38,21,40,21],[38,22,40,22],[40,17,40,19],[39,1,39,3],[40,1,40,3],[38,1,38,3],[38,17,38,19],[4,28,4,29],[5,28,5,29],[4,21,4,27],[5,21,5,27],[4,12,4,13],[4,5,4,11],[5,5,5,11],[5,12,5,13],[9,13,11,13],[9,12,11,12],[6,28,6,29],[9,20,11,20],[9,21,11,21],[9,23,11,23],[6,12,6,13],[9,27,11,27],[9,28,11,28],[9,29,11,29],[9,22,11,22],[6,21,6,27],[6,5,6,11],[9,5,11,5],[9,6,11,6],[9,7,11,7],[27,17,27,19],[9,14,11,14],[23,17,23,19],[24,17,24,18],[25,17,25,19],[9,1,9,3],[9,17,9,19],[10,1,10,3],[11,1,11,3],[10,17,10,19],[11,17,11,19]]}
["OFA 第 30 回 大分県ジュニアサッカー選手権大会",null,null,null,null,null,null,null,null,null,"予選リーグ結果　報告用紙",null,null,null,null,null,"OFA 第 30 回 大分県ジュニアサッカー選手権大会",null,null,null,null,null,null,null,null,null,"予選リーグ結果　報告用紙"]
[]
["会場","大分県大分スポーツ公園　だいぎんサッカー・ラグビー場　B　南側",null,null,null,null,null,null,null,null,null,null,null,null,null,null,null,"会場","大分県大分スポーツ公園　だいぎんサッカー・ラグビー場　B　南側"]
[]
[null,null,null,null,"F1","スマイス・セレソン",null,null,null,null,null,null,"別府",null,null,null,null,null,null,null,"H1","ＫＩＮＧＳ　ＦＯＯＴＢＡＬＬＣＬＵＢ　Ｕ－１２",null,null,null,null,null,null,"大分"]
[null,null,null,null,"F2","ＦＣ　ＲＥＧＡＴＥ",null,null,null,null,null,null,"大分",null,null,null,null,null,null,null,"H2","カティオーラフットボールクラブ　高城",null,null,null,null,null,null,"大分"]
[null,null,null,null,"F3","佐伯リベロフットボールクラブ",null,null,null,null,null,null,"佐伯",null,null,null,null,null,null,null,"H3","ＦＣ安岐",null,null,null,null,null,null,"速杵国東"]
[]
[]
["MC","磯村　信一",null,null,"10:00:00","スマイス・セレソン",1,"（",0,"前半",0,"）",0,"ＦＣ　ＲＥＧＡＴＥ",null,null,"MC","佐々木　秀樹",null,null,"10:40:00","ＫＩＮＧＳ　ＦＯＯＴＢＡＬＬＣＬＵＢ　Ｕ－１２",2,"（",2,"前半",0,"）",1,"カティオーラフットボールクラブ　高城"]
["Welfare\nOfficer",null,null,null,null,null,null,null,1,"後半",0,null,null,null,null,null,"Welfare\nOfficer",null,null,null,null,null,null,null,0,"後半",1]
["記録","福元　研治",null,null,null,null,null,null,null,"PK",null,null,null,null,null,null,"記録","磯村　信一",null,null,null,null,null,null,null,"PK"]
["＜Referee＞",null,null,null,"警告/退場\n選択肢より","氏名","番号","分","内容\n選択肢より",null,"内容\n選択肢より","分","番号","氏名","警告/退場\n選択肢より",null,"＜Referee＞",null,null,null,"警告/退場\n選択肢より","氏名","番号","分","内容\n選択肢より",null,"内容\n選択肢より","分","番号","氏名","警告/退場\n選択肢より"]
[null,null,null,null,"得点者","",null,null,null,null,null,null,null,"",null,null,null,null,null,null,"得点者","",null,null,null,null,null,null,null,""]
[null,null,null,null,"得点者","",null,null,null,null,null,null,null,"",null,null,null,null,null,null,"得点者","",null,null,null,null,null,null,null,""]
[null,null,null,null,"得点者","",null,null,null,null,null,null,null,"",null,null,null,null,null,null,"得点者","",null,null,null,null,null,null,null,""]
[null,null,null,null,"得点者","",null,null,null,null,null,null,null,"",null,null,null,null,null,null,"得点者","",null,null,null,null,null,null,null,""]
[null,null,null,null,"得点者","",null,null,null,null,null,null,null,"",null,null,null,null,null,null,"得点者","",null,null,null,null,null,null,null,""]
[null,null,null,null,"得点者","",null,null,null,null,null,null,null,"",null,null,null,null,null,null,"得点者","",null,null,null,null,null,null,null,""]
[null,null,null,null,"得点者","",null,null,null,null,null,null,null,"",null,null,null,null,null,null,"得点者","",null,null,null,null,null,null,null,""]
[null,null,null,null,"得点者","",null,null,null,null,null,null,null,"",null,null,null,null,null,null,"得点者","",null,null,null,null,null,null,null,""]
[null,null,null,null,"得点者","",null,null,null,null,null,null,null,"",null,null,null,null,null,null,"得点者","",null,null,null,null,null,null,null,""]
[null,null,null,null,"得点者","",null,null,null,null,null,null,null,"",null,null,null,null,null,null,"得点者","",null,null,null,null,null,null,null,""]
["番号","R005405255",null,null,null,"",null,null,null,null,null,null,null,"",null,null,"番号","R004060259",null,null,null,"",null,null,null,null,null,null,null,""]
["R","小手川　朋輝",null,"3級",null,"",null,null,null,null,null,null,null,"",null,null,"R","松本　祐輔",null,"3級",null,"",null,null,null,null,null,null,null,""]
["番号","R009546073",null,null,null,"",null,null,null,null,null,null,null,"",null,null,"番号","R004326535",null,null,null,"",null,null,null,null,null,null,null,""]
["AR1:","小玉　篤史",null,"3級",null,"",null,null,null,null,null,null,null,"",null,null,"AR1:","信田　卓也",null,"3級",null,"",null,null,null,null,null,null,null,""]
["番号","R010189323",null,null,null,"",null,null,null,null,null,null,null,"",null,null,"番号","R010013254",null,null,null,"",null,null,null,null,null,null,null,""]
["AR2:","安部　孝之",null,"3級",null,"",null,null,null,null,null,null,null,"",null,null,"AR2:","安藤　暢",null,"3級",null,"",null,null,null,null,null,null,null,""]
["番号","R009460551",null,null,null,"",null,null,null,null,null,null,null,"",null,null,"番号","R005405255",null,null,null,"",null,null,null,null,null,null,null,""]
["4th:","佐藤　慎二",null,"3級",null,"",null,null,null,null,null,null,null,"",null,null,"4th:","小手川　朋輝",null,"3級",null,"",null,null,null,null,null,null,null,""]
[]
[]
[]
[]
[]
[]
[]
["MC","福元　研治",null,null,"11:20:00","ＦＣ　ＲＥＧＡＴＥ",0,"（",0,"前半",1,"）",2,"佐伯リベロフットボールクラブ",null,null,"MC","磯村　信一",null,null,"12:00:00","カティオーラフットボールクラブ　高城",6,"（",2,"前半",0,"）",0,"ＦＣ安岐"]
["Welfare\nOfficer",null,null,null,null,null,null,null,0,"後半",1,null,null,null,null,null,"Welfare\nOfficer",null,null,null,null,null,null,null,4,"後半",0]
["記録","佐々木　秀樹",null,null,null,null,null,null,null,"PK",null,null,null,null,null,null,"記録","福元　研治",null,null,null,null,null,null,null,"PK"]
["＜Referee＞",null,null,null,"警告/退場\n選択肢より","氏名","番号","分","内容\n選択肢より",null,"内容\n選択肢より","分","番号","氏名","警告/退場\n選択肢より",null,"＜Referee＞",null,null,null,"警告/退場\n選択肢より","氏名","番号","分","内容\n選択肢より",null,"内容\n選択肢より","分","番号","氏名","警告/退場\n選択肢より"]
[null,null,null,null,"得点者","",null,null,null,null,null,null,null,"",null,null,null,null,null,null,"得点者","",null,null,null,null,null,null,null,""]
[null,null,null,null,"得点者","",null,null,null,null,null,null,null,"",null,null,null,null,null,null,"得点者","",null,null,null,null,null,null,null,""]
[null,null,null,null,"得点者","",null,null,null,null,null,null,null,"",null,null,null,null,null,null,"得点者","",null,null,null,null,null,null,null,""]
[null,null,null,null,"得点者","",null,null,null,null,null,null,null,"",null,null,null,null,null,null,"得点者","",null,null,null,null,null,null,null,""]
[null,null,null,null,"得点者","",null,null,null,null,null,null,null,"",null,null,null,null,null,null,"得点者","",null,null,null,null,null,null,null,""]
[null,null,null,null,"得点者","",null,null,null,null,null,null,null,"",null,null,null,null,null,null,"得点者","",null,null,null,null,null,null,null,""]
[null,null,null,null,"得点者","",null,null,null,null,null,null,null,"",null,null,null,null,null,null,"得点者","",null,null,null,null,null,null,null,""]
[null,null,null,null,"得点者","",null,null,null,null,null,null,null,"",null,null,null,null,null,null,"得点者","",null,null,null,null,null,null,null,""]
[null,null,null,null,"得点者","",null,null,null,null,null,null,null,"",null,null,null,null,null,null,"得点者","",null,null,null,null,null,null,null,""]
[null,null,null,null,"得点者","",null,null,null,null,null,null,null,"",null,null,null,null,null,null,"得点者","",null,null,null,null,null,null,null,""]
["番号","R009460551",null,null,null,"",null,null,null,null,null,null,null,"",null,null,"番号","R005405255",null,null,null,"",null,null,null,null,null,null,null,""]
["R","佐藤　慎二",null,"3級",null,"",null,null,null,null,null,null,null,"",null,null,"R","小手川　朋輝",null,"3級",null,"",null,null,null,null,null,null,null,""]
["番号","R010189323",null,null,null,"",null,null,null,null,null,null,null,"",null,null,"番号","R010013254",null,null,null,"",null,null,null,null,null,null,null,""]
["AR1:","安部　孝之",null,"3級",null,"",null,null,null,null,null,null,null,"",null,null,"AR1:","安藤　暢",null,"3級",null,"",null,null,null,null,null,null,null,""]
["番号","R010189301",null,null,null,"",null,null,null,null,null,null,null,"",null,null,"番号","R007686261",null,null,null,"",null,null,null,null,null,null,null,""]
["AR2:","工藤　拓海",null,"3級",null,"",null,null,null,null,null,null,null,"",null,null,"AR2:","大友　拓郎",null,"3級",null,"",null,null,null,null,null,null,null,""]
["番号","R004060259",null,null,null,"",null,null,null,null,null,null,null,"",null,null,"番号","R009460551",null,null,null,"",null,null,null,null,null,null,null,""]
["4th:","松本　祐輔",null,"3級",null,"",null,null,null,null,null,null,null,"",null,null,"4th:","佐藤　慎二",null,"3級",null,"",null,null,null,null,null,null,null,""]
[]
[]
[]
[]
[]
[]
[]
["MC","佐々木　秀樹",null,null,"13:20:00","佐伯リベロフットボールクラブ",1,"（",0,"前半",2,"）",2,"スマイス・セレソン",null,null,"MC","福元　研治",null,null,"14:00:00","ＦＣ安岐",1,"（",0,"前半",3,"）",11,"ＫＩＮＧＳ　ＦＯＯＴＢＡＬＬＣＬＵＢ　Ｕ－１２"]
["Welfare\nOfficer",null,null,null,null,null,null,null,1,"後半",0,null,null,null,null,null,"Welfare\nOfficer",null,null,null,null,null,null,null,1,"後半",8]
["記録","磯村　信一",null,null,null,null,null,null,null,"PK",null,null,null,null,null,null,"記録","佐々木　秀樹",null,null,null,null,null,null,null,"PK"]
["＜Referee＞",null,null,null,"警告/退場\n選択肢より","氏名","番号","分","内容\n選択肢より",null,"内容\n選択肢より","分","番号","氏名","警告/退場\n選択肢より",null,"＜Referee＞",null,null,null,"警告/退場\n選択肢より","氏名","番号","分","内容\n選択肢より",null,"内容\n選択肢より","分","番号","氏名","警告/退場\n選択肢より"]
[null,null,null,null,"得点者","",null,null,null,null,null,null,null,"",null,null,null,null,null,null,"得点者","",null,null,null,null,null,null,null,""]
[null,null,null,null,"得点者","",null,null,null,null,null,null,null,"",null,null,null,null,null,null,"得点者","",null,null,null,null,null,null,null,""]
[null,null,null,null,"得点者","",null,null,null,null,null,null,null,"",null,null,null,null,null,null,"得点者","",null,null,null,null,null,null,null,""]
[null,null,null,null,"得点者","",null,null,null,null,null,null,null,"",null,null,null,null,null,null,"得点者","",null,null,null,null,null,null,null,""]
[null,null,null,null,"得点者","",null,null,null,null,null,null,null,"",null,null,null,null,null,null,"得点者","",null,null,null,null,null,null,null,""]
[null,null,null,null,"得点者","",null,null,null,null,null,null,null,"",null,null,null,null,null,null,"得点者","",null,null,null,null,null,null,null,""]
[null,null,null,null,"得点者","",null,null,null,null,null,null,null,"",null,null,null,null,null,null,"得点者","",null,null,null,null,null,null,null,""]
[null,null,null,null,"得点者","",null,null,null,null,null,null,null,"",null,null,null,null,null,null,"得点者","",null,null,null,null,null,null,null,""]
[null,null,null,null,"得点者","",null,null,null,null,null,null,null,"",null,null,null,null,null,null,"得点者","",null,null,null,null,null,null,null,""]
[null,null,null,null,"得点者","",null,null,null,null,null,null,null,"",null,null,null,null,null,null,"得点者","",null,null,null,null,null,null,null,""]
["番号","R004060259",null,null,null,"",null,null,null,null,null,null,null,"",null,null,"番号","R009460551",null,null,null,"",null,null,null,null,null,null,null,""]
["R","松本　祐輔",null,"3級",null,"",null,null,null,null,null,null,null,"",null,null,"R","佐藤　慎二",null,"3級",null,"",null,null,null,null,null,null,null,""]
["番号","R010189301",null,null,null,"",null,null,null,null,null,null,null,"",null,null,"番号","R007686261",null,null,null,"",null,null,null,null,null,null,null,""]
["AR1:","工藤　拓海",null,"3級",null,"",null,null,null,null,null,null,null,"",null,null,"AR1:","大友　拓郎",null,"3級",null,"",null,null,null,null,null,null,null,""]
["番号","R009546073",null,null,null,"",null,null,null,null,null,null,null,"",null,null,"番号","R004326535",null,null,null,"",null,null,null,null,null,null,null,""]
["AR2:","小玉　篤史",null,"3級",null,"",null,null,null,null,null,null,null,"",null,null,"AR2:","信田　卓也",null,"3級",null,"",null,null,null,null,null,null,null,""]
["番号","R005405255",null,null,null,"",null,null,null,null,null,null,null,"",null,null,"番号","R004060259",null,null,null,"",null,null,null,null,null,null,null,""]
["4th:","小手川　朋輝",null,"3級",null,"",null,null,null,null,null,null,null,"",null,null,"4th:","松本　祐輔",null,"3級",null,"",null,null,null,null,null,null,null,""]

{"sheet":"決勝トーナメント","index":12,"n_rows":31,"n_cols":32,"rows_kept":31,"cut":false,"hidden":false,"merged":[[2,6,2,11],[2,13,2,14],[24,9,24,10],[8,18,11,18],[12,18,15,18],[16,18,19,18],[20,18,23,18],[26,18,29,18],[24,18,25,18],[24,15,24,16],[23,14,23,15],[23,6,23,7],[25,15,25,16],[25,13,25,14],[18,12,18,13],[25,7,25,8],[24,7,24,8],[20,14,20,15],[22,14,22,15],[25,5,25,6],[4,8,7,9],[9,8,9,9],[10,8,10,9],[11,12,11,13],[13,12,16,13],[5,13,5,14],[24,3,24,4],[11,4,11,5],[20,2,20,3],[24,1,24,2],[18,4,18,5],[13,4,16,5],[24,5,24,6],[25,11,25,12],[29,4,29,5],[19,4,19,5],[25,1,25,2],[22,2,22,3],[20,6,20,7],[22,6,22,7],[25,9,25,10],[27,6,27,7],[27,10,27,11],[23,2,23,3],[25,3,25,4],[27,2,27,3],[28,4,28,5],[28,12,28,13],[29,12,29,13],[24,11,24,12],[23,10,23,11],[20,10,20,11],[24,13,24,14],[22,10,22,11],[27,14,27,15],[19,12,19,13],[0,21,1,32],[30,19,31,20],[26,19,29,20],[24,19,25,20],[20,19,23,20],[16,19,19,20],[12,19,15,20],[8,19,11,20],[6,19,7,20],[4,19,5,20],[2,19,3,20],[12,25,13,26],[12,27,13,28],[12,31,13,32],[14,21,15,22],[14,25,15,26],[14,27,15,28],[14,31,15,32],[16,21,17,22],[16,25,17,26],[16,27,17,28],[16,31,17,32],[18,21,19,22],[18,25,19,26],[30,18,31,18],[30,21,31,32],[24,21,25,32],[2,21,3,26],[2,27,3,32],[26,23,29,24],[26,29,29,30],[20,23,23,24],[20,29,23,30],[16,23,19,24],[16,29,19,30],[12,29,15,30],[12,23,15,24],[8,23,11,24],[8,29,11,30],[8,21,9,22],[8,25,9,26],[8,27,9,28],[8,31,9,32],[10,31,11,32],[10,27,11,28],[10,25,11,26],[10,21,11,22],[12,21,13,22],[26,27,27,28],[26,31,27,32],[28,27,29,28],[28,31,29,32],[18,27,19,28],[18,31,19,32],[20,21,21,22],[20,25,21,26],[20,27,21,28],[20,31,21,32],[22,21,23,22],[22,25,23,26],[22,27,23,28],[22,31,23,32],[26,21,27,22],[26,25,27,26],[28,21,29,22],[28,25,29,26]]}
[null,"《決勝トーナメント日程》",null,null,null,null,null,"１２月２日（日）",null,null,null,null,"８：００　開場",null,null,null,null,null,null,null,null,"サッカー・ラグビーＡコート"]
[]
[null,null,null,null,null,null,"大分トリニータＵ－１２",null,null,null,null,null,null,"☆準優勝",null,null,null,null,null,"開始時刻",null,"「北」コート",null,null,null,null,null,"「南」コート"]
[null,null,null,null,null,null,null,null,null,null,null,null,null,"・スマイス・セレソン"]
[null,null,null,null,null,null,null,null,{"$f":"X27","v":"Match No：33\n0　 前半 　0\n0 　後半 　2\n--------------\n0 　合計 　2"},null,null,null,null,null,null,null,null,null,null,"ﾗｲﾝ引"]
[null,null,null,null,null,null,null,null,null,null,null,null,null,"☆３位"]
[null,null,null,null,null,null,null,null,null,null,null,null,null,"・ＭＳＳ",null,null,null,null,null,"審判"]
[null,null,null,null,null,null,null,null,null,null,null,null,null,"・中津沖代ＪＳＣ"]
[null,null,null,null,null,null,null,null,null,null,null,null,null,null,null,null,null,null,"①","09:30:00",null,"A-１位",null,"Match No：25\n1　 前半 　0\n0 　後半 　2\n--------------\n1 　合計 　2",null,"E-１位",null,"B-１位",null,"Match No：26\n0　 前半 　0\n0 　後半 　2\n--------------\n0 　合計 　2",null,"F-１位"]
[null,null,null,null,null,null,null,null,"Match No：33"]
[null,null,null,null,null,null,null,null,"１３：３０～北",null,null,null,null,null,null,null,null,null,null,null,null,{"$f":"B26","v":"大道"},null,null,null,{"$f":"D26","v":"中津沖代"},null,{"$f":"F26","v":"太陽大分西"},null,null,null,{"$f":"H26","v":"スマイス・セレソン"}]
[null,null,null,null,"スマイス・セレソン",null,null,null,null,null,null,null,"トリニータ"]
[null,null,null,null,null,null,null,null,null,null,null,null,null,null,null,null,null,null,"②","10:10:00",null,"C-１位",null,"Match No：27\n1　 前半 　0\n1 　後半 　2\n--------------\n2 　合計 　2\n3 　ＰＫ 　2",null,"G-１位",null,"D-１位",null,"Match No：28\n2　 前半 　0\n3 　後半 　1\n--------------\n5 　合計 　1",null,"H-１位"]
[null,null,null,null,{"$f":"X17","v":"Match No：29\n0　 前半 　1\n0 　後半 　0\n--------------\n0 　合計 　1"},null,null,null,null,null,null,null,{"$f":"X21","v":"Match No：31\n0　 前半 　0\n0 　後半 　1\n--------------\n0 　合計 　1"}]
[null,null,null,null,null,null,null,null,null,null,null,null,null,null,null,null,null,null,null,null,null,{"$f":"J26","v":"MSS"},null,null,null,{"$f":"L26","v":"ドリームキッズ"},null,{"$f":"N26","v":"トリニータ"},null,null,null,{"$f":"P26","v":"KINGS"}]
[]
[null,null,null,null,null,null,null,null,null,null,null,null,null,null,null,null,null,null,"③","10:50:00",null,"Match No：25 勝",null,"Match No：29\n0　 前半 　1\n0 　後半 　0\n--------------\n0 　合計 　1",null,"Match No：26 勝",null,"Match No：25  負",null,"Match No：30\n2　 前半 　0\n0 　後半 　0\n--------------\n2 　合計 　0",null,"Match No：26  負"]
[]
[null,null,null,null,"Match No：29",null,null,null,null,null,null,null,"Match No：31",null,null,null,null,null,null,null,null,{"$f":"C21","v":"中津沖代"},null,null,null,{"$f":"G21","v":"スマイス・セレソン"},null,{"$f":"C28","v":"大道"},null,null,null,{"$f":"G28","v":"太陽大分西"}]
[null,null,null,null,"１０：５０～北",null,null,null,null,null,null,null,"１１：３０～北"]
[null,null,"中津沖代",null,null,null,"スマイス・セレソン",null,null,null,"MSS",null,null,null,"トリニータ",null,null,null,"④","11:30:00",null,"Match No：27 勝",null,"Match No：31\n0　 前半 　0\n0 　後半 　1\n--------------\n0 　合計 　1",null,"Match No：28 勝",null,"Match No：27  負",null,"Match No：32\n0　 前半 　1\n1 　後半 　1\n--------------\n1 　合計 　2",null,"Match No：28  負"]
[]
[null,null,"Match No：25",null,null,null,"Match No：26",null,null,null,"Match No：27",null,null,null,"Match No：28",null,null,null,null,null,null,{"$f":"K21","v":"MSS"},null,null,null,{"$f":"O21","v":"トリニータ"},null,{"$f":"K28","v":"ドリームキッズ"},null,null,null,{"$f":"O28","v":"KINGS"}]
[null,null,"９：３０～北",null,null,null,"９：３０～南",null,null,null,"１０：１０～北",null,null,null,"１０：１０～南"]
[null,"A-１位",null,"E-１位",null,"B-１位",null,"F-１位",null,"C-１位",null,"G-１位",null,"D-１位",null,"H-１位",null,null,null,"12:10:00",null,"休憩"]
[null,"大道",null,"中津沖代",null,"太陽大分西",null,"スマイス・セレソン",null,"MSS",null,"ドリームキッズ",null,"トリニータ",null,"KINGS"]
[null,null,null,null,null,null,null,null,null,null,null,null,null,null,null,null,null,null,"⑤","13:30:00",null,"Match No：29 勝",null,"Match No：33\n0　 前半 　0\n0 　後半 　2\n--------------\n0 　合計 　2",null,"Match No：31 勝"]
[null,null,"大道",null,null,null,"太陽大分西",null,null,null,"ドリームキッズ",null,null,null,"KINGS"]
[null,null,null,null,"Match No：30",null,null,null,null,null,null,null,"Match No：32",null,null,null,null,null,null,null,null,{"$f":"E12","v":"スマイス・セレソン"},null,null,null,{"$f":"M12","v":"トリニータ"}]
[null,null,null,null,"１０：５０～南",null,null,null,null,null,null,null,"１１：３０～南"]
[null,null,null,null,null,null,null,null,null,null,null,null,null,null,null,null,null,null,null,"14:10:00",null,"閉会式"]

{"sheet":"決勝T公式記録","index":13,"n_rows":84,"n_cols":31,"rows_kept":84,"cut":false,"hidden":false,"merged":[[5,30,7,30],[33,30,35,30],[61,30,63,30],[0,0,0,9],[0,10,0,13],[0,16,0,25],[0,26,0,29],[75,16,75,19],[33,11,35,11],[33,12,35,12],[33,13,35,13],[19,0,19,3],[19,16,19,19],[47,0,47,3],[47,16,47,19],[54,17,54,19],[26,1,26,3],[33,27,35,27],[33,28,35,28],[55,17,55,18],[53,1,53,2],[53,17,53,18],[54,1,54,3],[26,17,26,19],[55,1,55,2],[61,14,63,14],[33,29,35,29],[48,17,48,19],[49,1,49,2],[49,17,49,18],[50,1,50,3],[50,17,50,19],[33,20,35,20],[33,21,35,21],[33,22,35,22],[33,23,35,23],[48,1,48,3],[33,14,35,14],[27,1,27,2],[27,17,27,18],[52,17,52,19],[33,4,35,4],[33,5,35,5],[33,6,35,6],[33,7,35,7],[51,1,51,2],[51,17,51,18],[52,1,52,3],[34,17,34,19],[35,17,35,19],[34,1,34,3],[35,1,35,3],[33,1,33,3],[33,17,33,19],[5,5,7,5],[5,6,7,6],[5,7,7,7],[5,14,7,14],[23,1,23,2],[23,17,23,18],[24,1,24,3],[24,17,24,19],[25,1,25,2],[25,17,25,18],[20,1,20,3],[20,17,20,19],[21,1,21,2],[21,17,21,18],[22,1,22,3],[22,17,22,19],[6,1,6,3],[7,1,7,3],[6,17,6,19],[7,17,7,19],[5,1,5,3],[5,17,5,19],[5,21,7,21],[5,22,7,22],[5,28,7,28],[5,29,7,29],[5,23,7,23],[5,27,7,27],[61,29,63,29],[78,1,78,3],[78,17,78,19],[61,20,63,20],[61,21,63,21],[61,22,63,22],[76,17,76,19],[77,1,77,2],[61,6,63,6],[61,7,63,7],[61,11,63,11],[61,12,63,12],[61,13,63,13],[5,11,7,11],[5,12,7,12],[5,13,7,13],[5,20,7,20],[5,4,7,4],[83,1,83,2],[83,17,83,18],[61,23,63,23],[61,27,63,27],[61,28,63,28],[81,1,81,2],[81,17,81,18],[82,1,82,3],[82,17,82,19],[76,1,76,3],[75,0,75,3],[79,1,79,2],[79,17,79,18],[80,1,80,3],[80,17,80,19],[77,17,77,18],[61,4,63,4],[61,5,63,5],[62,1,62,3],[63,1,63,3],[62,17,62,19],[63,17,63,19],[61,1,61,3],[61,17,61,19]]}
["OFA 第 30 回 大分県ジュニアサッカー選手権大会",null,null,null,null,null,null,null,null,null,"決勝トーナメント結果　報告用紙",null,null,null,null,null,"OFA 第 30 回 大分県ジュニアサッカー選手権大会",null,null,null,null,null,null,null,null,null,"決勝トーナメント結果　報告用紙"]
[]
["会場","大分県大分スポーツ公園　だいぎんサッカー・ラグビー場　A　北側",null,null,null,null,null,null,null,null,null,null,null,null,null,null,null,"会場","大分県大分スポーツ公園　だいぎんサッカー・ラグビー場　A　南側"]
[]
[null,"Match No：25",null,null,null,null,null,null,null,null,null,null,null,null,null,null,null,"Match No：26"]
["MC","仲野　昭博",null,null,"09:30:00","大道サッカースポーツ少年団",1,"（",1,"前半",0,"）",2,"中津沖代ＪＳＣ",null,null,"MC","中原　圭介",null,null,"09:30:00","太陽スポーツクラブ大分西",0,"（",0,"前半",0,"）",2,"スマイス・セレソン"]
["Welfare\nOfficer","山野内　哲朗",null,null,null,null,null,null,0,"後半",2,null,null,null,null,null,"Welfare\nOfficer","伊東　雅弘",null,null,null,null,null,null,0,"後半",2]
["記録","榊　謙治",null,null,null,null,null,null,null,"PK",null,null,null,null,null,null,"記録","市原　宗久",null,null,null,null,null,null,null,"PK"]
[null,null,null,null,null,"氏名","番号","分",null,null,null,"分","番号","氏名",null,null,null,null,null,null,null,"氏名","番号","分",null,null,null,"分","番号","氏名"]
[null,null,null,null,"得点者","",null,null,null,null,null,null,null,"",null,null,null,null,null,null,"得点者","",null,null,null,null,null,null,null,""]
[null,null,null,null,"得点者","",null,null,null,null,null,null,null,"",null,null,null,null,null,null,"得点者","",null,null,null,null,null,null,null,""]
[null,null,null,null,"得点者","",null,null,null,null,null,null,null,"",null,null,null,null,null,null,"得点者","",null,null,null,null,null,null,null,""]
[null,null,null,null,"得点者","",null,null,null,null,null,null,null,"",null,null,null,null,null,null,"得点者","",null,null,null,null,null,null,null,""]
[null,null,null,null,"得点者","",null,null,null,null,null,null,null,"",null,null,null,null,null,null,"得点者","",null,null,null,null,null,null,null,""]
[null,null,null,null,"得点者","",null,null,null,null,null,null,null,"",null,null,null,null,null,null,"得点者","",null,null,null,null,null,null,null,""]
[null,null,null,null,"得点者","",null,null,null,null,null,null,null,"",null,null,null,null,null,null,"得点者","",null,null,null,null,null,null,null,""]
[null,null,null,null,"得点者","",null,null,null,null,null,null,null,"",null,null,null,null,null,null,"得点者","",null,null,null,null,null,null,null,""]
[null,null,null,null,"得点者","",null,null,null,null,null,null,null,"",null,null,null,null,null,null,"得点者","",null,null,null,null,null,null,null,""]
[null,null,null,null,"得点者","",null,null,null,null,null,null,null,"",null,null,null,null,null,null,"得点者","",null,null,null,null,null,null,null,""]
["＜Referee＞",null,null,null,"警告/退場\n選択肢より","氏名","番号","分","内容\n選択肢より",null,"内容\n選択肢より","分","番号","氏名","警告/退場\n選択肢より",null,"＜Referee＞",null,null,null,"警告/退場\n選択肢より","氏名","番号","分","内容\n選択肢より",null,"内容\n選択肢より","分","番号","氏名","警告/退場\n選択肢より"]
["番号","R001262333",null,null,null,"",null,null,null,null,null,null,null,"",null,null,"番号","R000879756",null,null,null,"",null,null,null,null,null,null,null,""]
["R","諌本　秀樹",null,"2級",null,"",null,null,null,null,null,null,null,"",null,null,"R","足達　実生",null,"2級",null,"",null,null,null,null,null,null,null,""]
["番号","R003677131",null,null,null,"",null,null,null,null,null,null,null,"",null,null,"番号","R001261398",null,null,null,"",null,null,null,null,null,null,null,""]
["AR1:","久保　雅敬",null,"3級",null,"",null,null,null,null,null,null,null,"",null,null,"AR1:","森山　信浩",null,"3級",null,"",null,null,null,null,null,null,null,""]
["番号","R009460515",null,null,null,"",null,null,null,null,null,null,null,"",null,null,"番号","R003256053",null,null,null,"",null,null,null,null,null,null,null,""]
["AR2:","奥田　和彦",null,"3級",null,"",null,null,null,null,null,null,null,"",null,null,"AR2:","菊地　謙一",null,"3級",null,"",null,null,null,null,null,null,null,""]
["番号","R001265190",null,null,null,"",null,null,null,null,null,null,null,"",null,null,"番号","R001265437",null,null,null,"",null,null,null,null,null,null,null,""]
["4th:","宇野　耕二",null,"2級",null,"",null,null,null,null,null,null,null,"",null,null,"4th:","寺林　豊",null,"2級",null,"",null,null,null,null,null,null,null,""]
[]
[]
[]
[]
[null,"Match No：27",null,null,null,null,null,null,null,null,null,null,null,null,null,null,null,"Match No：28"]
["MC","津守　一雄",null,null,"10:10:00","ＭＳＳ",2,"（",1,"前半",0,"）",2,"ドリームキッズサッカークラブ",null,null,"MC","中野　観司郎",null,null,"10:10:00","大分トリニータＵ－１２",5,"（",2,"前半",0,"）",1,"ＫＩＮＧＳ　ＦＯＯＴＢＡＬＬＣＬＵＢ　Ｕ－１２"]
["Welfare\nOfficer","安東　信二",null,null,null,null,null,null,1,"後半",2,null,null,null,null,null,"Welfare\nOfficer","松下　省吾",null,null,null,null,null,null,3,"後半",1]
["記録","笠野　わかこ",null,null,null,null,null,null,3,"PK",2,null,null,null,null,null,"記録","秋吉　明",null,null,null,null,null,null,null,"PK"]
[null,null,null,null,null,"氏名","番号","分",null,null,null,"分","番号","氏名",null,null,null,null,null,null,null,"氏名","番号","分",null,null,null,"分","番号","氏名"]
[null,null,null,null,"得点者","",null,null,null,null,null,null,null,"",null,null,null,null,null,null,"得点者","",null,null,null,null,null,null,null,""]
[null,null,null,null,"得点者","",null,null,null,null,null,null,null,"",null,null,null,null,null,null,"得点者","",null,null,null,null,null,null,null,""]
[null,null,null,null,"得点者","",null,null,null,null,null,null,null,"",null,null,null,null,null,null,"得点者","",null,null,null,null,null,null,null,""]
[null,null,null,null,"得点者","",null,null,null,null,null,null,null,"",null,null,null,null,null,null,"得点者","",null,null,null,null,null,null,null,""]
[null,null,null,null,"得点者","",null,null,null,null,null,null,null,"",null,null,null,null,null,null,"得点者","",null,null,null,null,null,null,null,""]
[null,null,null,null,"得点者","",null,null,null,null,null,null,null,"",null,null,null,null,null,null,"得点者","",null,null,null,null,null,null,null,""]
[null,null,null,null,"得点者","",null,null,null,null,null,null,null,"",null,null,null,null,null,null,"得点者","",null,null,null,null,null,null,null,""]
[null,null,null,null,"得点者","",null,null,null,null,null,null,null,"",null,null,null,null,null,null,"得点者","",null,null,null,null,null,null,null,""]
[null,null,null,null,"得点者","",null,null,null,null,null,null,null,"",null,null,null,null,null,null,"得点者","",null,null,null,null,null,null,null,""]
[null,null,null,null,"得点者","",null,null,null,null,null,null,null,"",null,null,null,null,null,null,"得点者","",null,null,null,null,null,null,null,""]
["＜Referee＞",null,null,null,"警告/退場\n選択肢より","氏名","番号","分","内容\n選択肢より",null,"内容\n選択肢より","分","番号","氏名","警告/退場\n選択肢より",null,"＜Referee＞",null,null,null,"警告/退場\n選択肢より","氏名","番号","分","内容\n選択肢より",null,"内容\n選択肢より","分","番号","氏名","警告/退場\n選択肢より"]
["番号","R010093443",null,null,null,"",null,null,null,null,null,null,null,"",null,null,"番号","R006664961",null,null,null,"",null,null,null,null,null,null,null,""]
["R","内山田　光史",null,"3級",null,"",null,null,null,null,null,null,null,"",null,null,"R","末吉　裕樹",null,"3級",null,"",null,null,null,null,null,null,null,""]
["番号","R009460551",null,null,null,"",null,null,null,null,null,null,null,"",null,null,"番号","R010069871",null,null,null,"",null,null,null,null,null,null,null,""]
["AR1:","佐藤　慎二",null,"3級",null,"",null,null,null,null,null,null,null,"",null,null,"AR1:","足立　卓也",null,"3級",null,"",null,null,null,null,null,null,null,""]
["番号","R005603486",null,null,null,"",null,null,null,null,null,null,null,"",null,null,"番号","R003972443",null,null,null,"",null,null,null,null,null,null,null,""]
["AR2:","山本　篤",null,"3級",null,"",null,null,null,null,null,null,null,"",null,null,"AR2:","矢野　三千生",null,"3級",null,"",null,null,null,null,null,null,null,""]
["番号","R007335136",null,null,null,"",null,null,null,null,null,null,null,"",null,null,"番号","R008798013",null,null,null,"",null,null,null,null,null,null,null,""]
["4th:","佐々木　秀樹",null,"3級",null,"",null,null,null,null,null,null,null,"",null,null,"4th:","隅田　哲平",null,"3級",null,"",null,null,null,null,null,null,null,""]
[]
[]
[]
[]
[null,"Match No：30",null,null,null,null,null,null,null,null,null,null,null,null,null,null,null,"Match No：32"]
["MC","市原　宗久",null,null,"10:50:00","大道サッカースポーツ少年団",2,"（",2,"前半",0,"）",0,"太陽スポーツクラブ大分西",null,null,"MC","松下　省吾",null,null,"11:30:00","ドリームキッズサッカークラブ",1,"（",0,"前半",1,"）",2,"ＫＩＮＧＳ　ＦＯＯＴＢＡＬＬＣＬＵＢ　Ｕ－１２"]
["Welfare\nOfficer",null,null,null,null,null,null,null,0,"後半",0,null,null,null,null,null,"Welfare\nOfficer",null,null,null,null,null,null,null,1,"後半",1]
["記録",null,null,null,null,null,null,null,null,"PK",null,null,null,null,null,null,"記録",null,null,null,null,null,null,null,null,"PK"]
[null,null,null,null,null,"氏名","番号","分",null,null,null,"分","番号","氏名",null,null,null,null,null,null,null,"氏名","番号","分",null,null,null,"分","番号","氏名"]
[null,null,null,null,"得点者","",null,null,null,null,null,null,null,"",null,null,null,null,null,null,"得点者","",null,null,null,null,null,null,null,""]
[null,null,null,null,"得点者","",null,null,null,null,null,null,null,"",null,null,null,null,null,null,"得点者","",null,null,null,null,null,null,null,""]
[null,null,null,null,"得点者","",null,null,null,null,null,null,null,"",null,null,null,null,null,null,"得点者","",null,null,null,null,null,null,null,""]
[null,null,null,null,"得点者","",null,null,null,null,null,null,null,"",null,null,null,null,null,null,"得点者","",null,null,null,null,null,null,null,""]
[null,null,null,null,"得点者","",null,null,null,null,null,null,null,"",null,null,null,null,null,null,"得点者","",null,null,null,null,null,null,null,""]
[null,null,null,null,"得点者","",null,null,null,null,null,null,null,"",null,null,null,null,null,null,"得点者","",null,null,null,null,null,null,null,""]
[null,null,null,null,"得点者","",null,null,null,null,null,null,null,"",null,null,null,null,null,null,"得点者","",null,null,null,null,null,null,null,""]
[null,null,null,null,"得点者","",null,null,null,null,null,null,null,"",null,null,null,null,null,null,"得点者","",null,null,null,null,null,null,null,""]
[null,null,null,null,"得点者","",null,null,null,null,null,null,null,"",null,null,null,null,null,null,"得点者","",null,null,null,null,null,null,null,""]
[null,null,null,null,"得点者","",null,null,null,null,null,null,null,"",null,null,null,null,null,null,"得点者","",null,null,null,null,null,null,null,""]
["＜Referee＞",null,null,null,"警告/退場\n選択肢より","氏名","番号","分","内容\n選択肢より",null,"内容\n選択肢より","分","番号","氏名","警告/退場\n選択肢より",null,"＜Referee＞",null,null,null,"警告/退場\n選択肢より","氏名","番号","分","内容\n選択肢より",null,"内容\n選択肢より","分","番号","氏名","警告/退場\n選択肢より"]
["番号","R007335136",null,null,null,"",null,null,null,null,null,null,null,"",null,null,"番号","R005603486",null,null,null,"",null,null,null,null,null,null,null,""]
["R","佐々木　秀樹",null,"3級",null,"",null,null,null,null,null,null,null,"",null,null,"R","山本　篤",null,"3級",null,"",null,null,null,null,null,null,null,""]
["番号",null,null,null,null,"",null,null,null,null,null,null,null,"",null,null,"番号",null,null,null,null,"",null,null,null,null,null,null,null,""]
["AR1:","",null,"",null,"",null,null,null,null,null,null,null,"",null,null,"AR1:","",null,"",null,"",null,null,null,null,null,null,null,""]
["番号",null,null,null,null,"",null,null,null,null,null,null,null,"",null,null,"番号",null,null,null,null,"",null,null,null,null,null,null,null,""]
["AR2:","",null,"",null,"",null,null,null,null,null,null,null,"",null,null,"AR2:","",null,"",null,"",null,null,null,null,null,null,null,""]
["番号",null,null,null,null,"",null,null,null,null,null,null,null,"",null,null,"番号",null,null,null,null,"",null,null,null,null,null,null,null,""]
["4th:","",null,"",null,"",null,null,null,null,null,null,null,"",null,null,"4th:","",null,"",null,"",null,null,null,null,null,null,null,""]

{"sheet":"準決勝公式記録No,29","index":14,"n_rows":71,"n_cols":51,"rows_kept":71,"cut":false,"hidden":false,"merged":[[69,13,69,19],[69,20,69,26],[69,27,69,35],[70,13,72,19],[70,20,72,26],[70,27,72,35],[58,29,58,30],[60,0,60,3],[60,5,60,9],[60,12,60,16],[60,18,60,33],[61,0,67,35],[58,3,58,5],[58,7,58,8],[58,11,58,13],[58,16,58,17],[58,20,58,21],[58,24,58,26],[69,6,69,12],[70,6,72,12],[56,3,56,4],[56,5,56,17],[56,21,56,22],[56,23,56,35],[57,3,57,4],[57,5,57,17],[57,21,57,22],[57,23,57,35],[54,3,54,4],[54,5,54,17],[54,21,54,22],[54,23,54,35],[55,3,55,4],[55,5,55,17],[55,21,55,22],[55,23,55,35],[52,3,52,4],[52,5,52,17],[52,21,52,22],[52,23,52,35],[53,3,53,4],[53,5,53,17],[53,21,53,22],[53,23,53,35],[50,27,50,28],[51,0,51,2],[51,3,51,4],[51,5,51,17],[51,18,51,20],[51,21,51,22],[51,23,51,35],[49,27,49,28],[50,7,50,8],[50,9,50,10],[50,11,50,12],[50,13,50,14],[50,15,50,16],[50,19,50,20],[50,21,50,22],[50,23,50,24],[50,25,50,26],[49,7,49,8],[49,9,49,10],[49,11,49,12],[49,13,49,14],[49,15,49,16],[49,19,49,20],[49,21,49,22],[49,23,49,24],[49,25,49,26],[47,27,47,28],[48,7,48,8],[48,9,48,10],[48,11,48,12],[48,13,48,14],[48,15,48,16],[48,19,48,20],[48,21,48,22],[48,23,48,24],[48,25,48,26],[48,27,48,28],[47,7,47,8],[47,9,47,10],[47,11,47,12],[47,13,47,14],[47,15,47,16],[47,19,47,20],[47,21,47,22],[47,23,47,24],[47,25,47,26],[45,29,45,35],[46,7,46,8],[46,9,46,10],[46,11,46,12],[46,13,46,14],[46,15,46,16],[46,19,46,20],[46,21,46,22],[46,23,46,24],[46,25,46,26],[45,17,45,18],[45,19,45,20],[45,21,45,22],[45,23,45,24],[45,25,45,26],[45,27,45,28],[46,27,46,28],[45,0,45,6],[45,7,45,8],[45,9,45,10],[45,11,45,12],[45,13,45,14],[45,15,45,16],[43,4,43,8],[43,12,43,16],[43,22,43,26],[40,4,40,8],[40,12,40,16],[40,22,40,26],[40,30,40,34],[43,30,43,34],[44,4,44,8],[44,12,44,16],[44,22,44,26],[44,30,44,34],[41,4,41,8],[41,12,41,16],[41,22,41,26],[41,30,41,34],[42,4,42,8],[42,12,42,16],[42,22,42,26],[42,30,42,34],[38,4,38,8],[38,12,38,16],[38,22,38,26],[34,11,34,15],[34,17,34,18],[34,20,34,24],[38,30,38,34],[39,4,39,8],[39,12,39,16],[39,22,39,26],[39,30,39,34],[35,28,36,34],[36,17,36,18],[37,4,37,8],[37,12,37,16],[37,22,37,26],[37,30,37,34],[35,2,36,8],[35,9,36,9],[30,11,30,15],[30,20,30,24],[31,11,31,15],[31,20,31,24],[35,20,36,26],[35,27,36,27],[32,11,32,15],[32,20,32,24],[33,11,33,15],[33,20,33,24],[35,10,36,16],[35,17,35,18],[27,11,27,15],[27,20,27,24],[28,11,28,15],[28,20,28,24],[29,11,29,15],[29,20,29,24],[23,16,23,19],[24,11,24,15],[24,20,24,24],[25,11,25,15],[25,20,25,24],[26,11,26,15],[26,20,26,24],[20,11,20,15],[20,20,20,24],[21,11,21,15],[21,20,21,24],[22,11,22,15],[22,20,22,24],[17,11,17,15],[17,20,17,24],[18,11,18,15],[18,20,18,24],[19,11,19,15],[19,20,19,24],[12,2,12,9],[14,30,14,31],[14,32,14,33],[14,34,14,35],[12,26,12,33],[15,11,15,15],[15,20,15,24],[16,11,16,15],[16,20,16,24],[13,32,13,33],[13,34,13,35],[13,41,13,42],[10,17,10,18],[10,21,10,22],[10,23,10,24],[8,32,8,35],[7,32,7,35],[8,1,8,10],[14,0,14,1],[14,2,14,3],[14,4,14,5],[14,6,14,7],[14,8,14,9],[14,26,14,27],[14,28,14,29],[12,41,12,42],[13,0,13,1],[13,2,13,3],[13,4,13,5],[13,6,13,7],[13,8,13,9],[13,17,13,18],[13,26,13,27],[13,28,13,29],[13,30,13,31],[7,20,11,20],[7,21,7,23],[9,12,9,14],[9,17,9,18],[8,11,8,14],[8,17,8,18],[8,22,8,31],[9,21,9,23],[7,0,7,2],[7,11,7,14],[7,15,11,15],[7,17,7,18],[10,13,10,14],[10,11,10,12],[11,17,11,18],[5,18,5,19],[5,21,5,25],[5,26,5,30],[3,31,3,35],[4,0,4,1],[4,2,6,8],[4,11,4,12],[4,18,4,19],[5,0,5,1],[5,11,5,12],[5,13,5,14],[6,0,6,1],[6,11,6,12],[5,31,5,35],[6,13,6,14],[6,18,6,19],[6,26,6,30],[1,28,2,29],[1,31,1,35],[2,0,2,1],[2,14,2,15],[2,16,2,17],[2,18,2,26],[2,31,2,35],[0,0,0,5],[0,6,0,9],[0,10,0,11],[1,0,1,1],[1,2,3,13],[1,15,1,16],[3,0,3,1],[3,14,3,15],[3,16,3,17],[3,18,3,26],[3,28,3,29]]}
["公式記録",null,null,null,null,null,"Match No：",null,null,null,29]
["大",null,"OFA 第30回 \n大分県ジュニアサッカー選手権大会\n大分県大会",null,null,null,null,null,null,null,null,null,null,null,"第",2,null,"日",null,null,null,null,null,null,null,null,null,"競技","30分",null,"記"]
["会",null,null,null,null,null,null,null,null,null,null,null,null,null,"1回戦",null,"2回戦",null,"平成30年　12月2日（日）",null,null,null,null,null,null,null,null,"時間",null,null,"録","伊東　雅弘"]
["名",null,null,null,null,null,null,null,null,null,null,null,null,null,"準決勝",null,"決勝",null,"試合開始　10時50分～",null,null,null,null,null,null,null,null,"延長","6分",null,"者","榊　謙治"]
["会",null,"大分県大分スポーツ公園\nだいぎんサッカー・ラグビー場\nＡコート　北側",null,null,null,null,null,null,"天","晴","風",null,"強","弱","無","芝","状","良好",null,"審","主審",null,null,null,null,"副審",null,null,null,null,"第4の審判員"]
[null,null,null,null,null,null,null,null,null,null,"曇","気温",null,19,null,"℃",null,null,"不良",null,null,"寺林　豊",null,null,null,null,"奥田　和彦",null,null,null,null,"森山　信浩"]
["場",null,null,null,null,null,null,null,null,"候","雨","湿度",null,54.1,null,"％","土","態","泥沼",null,"判",null,null,null,null,null,"久保　雅敬"]
["【チーム名】",null,null,null,null,null,null,null,null,null,null,null,null,null,null,0,0,"前半",null,1,1,"【チーム名】"]
[null,"中津沖代ＪＳＣ",null,null,null,null,null,null,null,null,null,"中津市",null,null,null,null,0,"後半",null,0,null,null,"スマイス・セレソン",null,null,null,null,null,null,null,null,null,"別府市"]
[null,null,null,null,null,null,null,null,null,null,null,null,"kick off",null,null,null,null,"延前",null,null,null,"kick off"]
[null,null,null,null,null,null,null,null,null,null,null,"番号",null,"PK",null,null,null,"延後",null,null,null,"PK",null,"番号"]
[null,null,null,null,null,null,null,null,null,null,null,"○","×","先","後",null,null,"ＰＫ戦",null,null,null,"先","後","○","×"]
[null,null,"シュート（得点者は○印）",null,null,null,null,null,null,null,"学",null,null,null,null,null,"番",null,null,"番",null,null,null,null,null,"学","シュート（得点者は○印）",null,null,null,null,null,null,null,null,null,null,null,null,null,null,"チーム名",null,"中津沖代ＪＳＣ",null,null,null,null,null,"チーム名","スマイス・セレソン"]
["合",null,"延",null,"延",null,"後",null,"前",null,null,null,"選","手","名",null,null,"位置",null,null,null,"選","手","名",null,null,"前",null,"後",null,"延",null,"延",null,"合",null,null,null,null,null,null,"地区名",null,"中津市",null,null,null,null,null,"地区名","別府市"]
["計",null,"後",null,"前",null,"半",null,"半",null,"年",null,null,null,null,null,"号",null,null,"号",null,null,null,null,null,"年","半",null,"半",null,"前",null,"後",null,"計"]
[null,0,null,null,null,null,null,null,null,null,4,"外園　湊心",null,null,null,null,18,"GK","GK",1,"阿部　巧翔",null,null,null,null,5,null,null,null,null,null,null,null,null,null,0]
[null,0,null,null,null,null,null,null,null,null,5,"大森　宗樹",null,null,null,null,1,"DF","DF",2,"渡辺　陽星",null,null,null,null,5,null,1,null,null,null,null,null,null,null,1]
[null,1,null,null,null,null,null,null,null,1,5,"田中　琉輝",null,null,null,null,2,"DF","DF",4,"原田　煌也",null,null,null,null,4,null,null,null,null,null,null,null,null,null,0]
[null,1,null,null,null,null,null,1,null,null,5,"井上　大和",null,null,null,null,15,"DF","DF",5,"石川　巧翔",null,null,null,null,5,null,2,null,null,null,null,null,null,null,2]
[null,1,null,null,null,null,null,null,null,1,5,"小野　悠真",null,null,null,null,12,"MF","MF",7,"小野　陽士",null,null,null,null,5,null,null,null,1,null,null,null,null,null,1]
[null,3,null,null,null,null,null,1,null,2,5,"長岡　観太",null,null,null,null,16,"MF","MF",9,"横田　啓",null,null,null,null,4,"①",2,null,null,null,null,null,null,null,2]
[null,0,null,null,null,null,null,null,null,null,5,"大久保　律輝",null,null,null,null,6,"FW","FW",8,"佐々木　大和",null,null,null,null,4,null,null,null,3,null,null,null,null,null,3]
[null,0,null,null,null,null,null,null,null,null,5,"佐々木　陽音",null,null,null,null,14,"FW","FW",10,"大室　響",null,null,null,null,5,null,5,null,3,null,null,null,null,null,8]
[null,null,null,null,null,null,null,null,null,null,null,null,null,null,null,null,"交替要員"]
[null,0,null,null,null,null,null,null,null,null,5,"古梶　颯大",null,null,null,null,3,"DF","DF",3,"土井　純音",null,null,null,null,5,null,null,null,null,null,null,null,null,null,0]
[null,0,null,null,null,null,null,null,null,null,5,"高木　悠成",null,null,null,null,4,"DF","FW",6,"財前　大翔",null,null,null,null,5,null,null,null,null,null,null,null,null,null,0]
[null,0,null,null,null,null,null,null,null,null,4,"久家　侑奈",null,null,null,null,17,"FW","MF",11,"膳瀬　晃希",null,null,null,null,5,null,null,null,null,null,null,null,null,null,0]
[null,0,null,null,null,null,null,null,null,null,4,"小野　煌人",null,null,null,null,19,"FW","DF",12,"伊藤　迅世",null,null,null,null,5,null,null,null,null,null,null,null,null,null,0]
[null,0,null,null,null,null,null,null,null,null,3,"太田　康介",null,null,null,null,20,"FW","MF",13,"堤　一惺",null,null,null,null,5,null,null,null,null,null,null,null,null,null,0]
[null,0,null,null,null,null,null,null,null,null,3,"佐々木　碧音",null,null,null,null,22,"FW","MF",14,"岩崎　蓮武",null,null,null,null,4,null,null,null,null,null,null,null,null,null,0]
[null,0,null,null,null,null,null,null,null,null,4,"甲斐　琉聖",null,null,null,null,24,"MF","FW",15,"安部　颯",null,null,null,null,4,null,null,null,null,null,null,null,null,null,0]
[null,0,null,null,null,null,null,null,null,null,3,"井手　碧",null,null,null,null,25,"FW","GK",16,"赤野　陽亮",null,null,null,null,5,null,null,null,null,null,null,null,null,null,0]
[null,0,null,null,null,null,null,null,null,null,"","",null,null,null,null,null,"","",null,"",null,null,null,null,"",null,null,null,null,null,null,null,null,null,0]
[null,0,null,null,null,null,null,null,null,null,"","",null,null,null,null,null,"","",null,"",null,null,null,null,"",null,null,null,null,null,null,null,null,null,0]
[null,6,null,0,null,0,null,2,null,4,"小計",6,null,null,null,null,"合計","シュート数",null,"合計",17,null,null,null,null,"小計",null,10,null,7,null,0,null,0,null,17]
[null,null,"OUT",null,null,null,null,null,null,"→","IN",null,null,null,null,null,null,"交代",null,null,"OUT",null,null,null,null,null,null,"→","IN"]
[null,null,null,null,null,null,null,null,null,null,null,null,null,null,null,null,null,"選手"]
[null,"分",null,"番","",null,null,null,null,"→",null,"番","",null,null,null,null,null,16,"分",2,"番","渡辺　陽星",null,null,null,null,"→",3,"番","土井　純音"]
[null,"分",null,"番","",null,null,null,null,"→",null,"番","",null,null,null,null,null,null,"分",null,"番","",null,null,null,null,"→",null,"番",""]
[null,"分",null,"番","",null,null,null,null,"→",null,"番","",null,null,null,null,null,null,"分",null,"番","",null,null,null,null,"→",null,"番",""]
[null,"分",null,"番","",null,null,null,null,"→",null,"番","",null,null,null,null,null,null,"分",null,"番","",null,null,null,null,"→",null,"番",""]
[null,"分",null,"番","",null,null,null,null,"→",null,"番","",null,null,null,null,null,null,"分",null,"番","",null,null,null,null,"→",null,"番",""]
[null,"分",null,"番","",null,null,null,null,"→",null,"番","",null,null,null,null,null,null,"分",null,"番","",null,null,null,null,"→",null,"番",""]
[null,"分",null,"番","",null,null,null,null,"→",null,"番","",null,null,null,null,null,null,"分",null,"番","",null,null,null,null,"→",null,"番",""]
[null,"分",null,"番","",null,null,null,null,"→",null,"番","",null,null,null,null,null,null,"分",null,"番","",null,null,null,null,"→",null,"番",""]
["警告（Ｃ）・退場（Ｓ）など",null,null,null,null,null,null,"合計",null,"延後",null,"延前",null,"後半",null,"前半",null,"チーム\n合計",null,"前半",null,"後半",null,"延前",null,"延後",null,"合計",null,"警告（Ｃ）・退場（Ｓ）など"]
[null,null,null,null,null,null,null,6,null,null,null,null,null,2,null,4,null,"Ｇ","Ｋ",3,null,0,null,null,null,null,null,3]
[null,null,null,null,null,null,null,3,null,null,null,null,null,2,null,1,null,"Ｃ","Ｋ",1,null,3,null,null,null,null,null,4]
[null,null,null,null,null,null,null,2,null,null,null,null,null,1,null,1,null,"直接","ＦＫ",2,null,0,null,null,null,null,null,2]
[null,null,null,null,null,null,null,2,null,null,null,null,null,0,null,2,null,"間接","ＦＫ",0,null,1,null,null,null,null,null,1]
[null,null,null,null,null,null,null,0,null,null,null,null,null,0,null,0,null,"Ｐ","Ｋ",0,null,0,null,null,null,null,null,0]
["時間",null,null,"得点者",null,"得　　点　　経　　過",null,null,null,null,null,null,null,null,null,null,null,null,"時間",null,null,"得点者",null,"得　　点　　経　　過"]
[null,null,"分",null,null,null,null,null,null,null,null,null,null,null,null,null,null,null,null,8,"分",9,null,"１０～Ｓ　GKこぼれ　９Ｓ"]
[null,null,"分",null,null,null,null,null,null,null,null,null,null,null,null,null,null,null,null,null,"分"]
[null,null,"分",null,null,null,null,null,null,null,null,null,null,null,null,null,null,null,null,null,"分"]
[null,null,"分",null,null,null,null,null,null,null,null,null,null,null,null,null,null,null,null,null,"分"]
[null,null,"分",null,null,null,null,null,null,null,null,null,null,null,null,null,null,null,null,null,"分"]
[null,null,"分",null,null,null,null,null,null,null,null,null,null,null,null,null,null,null,null,null,"分"]
[" ",null,null,"《略号例》",null,null,null,"ドリブル",null,"～",null,"ゴロのパス",null,null,"→",null,"浮き球",null,"∩",null,"混戦",null,"×",null,"ヘディング",null,null,"H",null,"シュート",null,"S"]
[]
["戦評者氏名",null,null,null,"（",null,null,null,null,null,"）",null,"勤務先または所属",null,null,null,null,"（","一般社団法人　大分県サッカー協会　技術委員会",null,null,null,null,null,null,null,null,null,null,null,null,null,null,null,"　）"]
[]
[]
[]
[]
[]
[]
[]
[]
[null,null,null,null,null,null,"M   C",null,null,null,null,null,null,"会　場　長",null,null,null,null,null,null,"ウェルフェアオフィサー",null,null,null,null,null,null,"主　　審"]
[null,null,null,null,null,null,"仲野　昭博",null,null,null,null,null,null,"安東　幹雄",null,null,null,null,null,null,"山野内　哲朗",null,null,null,null,null,null,"寺林　豊"]

{"sheet":"準決勝公式記録No,31","index":15,"n_rows":71,"n_cols":51,"rows_kept":71,"cut":false,"hidden":false,"merged":[[69,13,69,19],[69,20,69,26],[69,27,69,35],[70,13,72,19],[70,20,72,26],[70,27,72,35],[58,29,58,30],[60,0,60,3],[60,5,60,9],[60,12,60,16],[60,18,60,33],[61,0,67,35],[58,3,58,5],[58,7,58,8],[58,11,58,13],[58,16,58,17],[58,20,58,21],[58,24,58,26],[69,6,69,12],[70,6,72,12],[56,3,56,4],[56,5,56,17],[56,21,56,22],[56,23,56,35],[57,3,57,4],[57,5,57,17],[57,21,57,22],[57,23,57,35],[54,3,54,4],[54,5,54,17],[54,21,54,22],[54,23,54,35],[55,3,55,4],[55,5,55,17],[55,21,55,22],[55,23,55,35],[52,3,52,4],[52,5,52,17],[52,21,52,22],[52,23,52,35],[53,3,53,4],[53,5,53,17],[53,21,53,22],[53,23,53,35],[50,27,50,28],[51,0,51,2],[51,3,51,4],[51,5,51,17],[51,18,51,20],[51,21,51,22],[51,23,51,35],[49,27,49,28],[50,7,50,8],[50,9,50,10],[50,11,50,12],[50,13,50,14],[50,15,50,16],[50,19,50,20],[50,21,50,22],[50,23,50,24],[50,25,50,26],[49,7,49,8],[49,9,49,10],[49,11,49,12],[49,13,49,14],[49,15,49,16],[49,19,49,20],[49,21,49,22],[49,23,49,24],[49,25,49,26],[47,27,47,28],[48,7,48,8],[48,9,48,10],[48,11,48,12],[48,13,48,14],[48,15,48,16],[48,19,48,20],[48,21,48,22],[48,23,48,24],[48,25,48,26],[48,27,48,28],[47,7,47,8],[47,9,47,10],[47,11,47,12],[47,13,47,14],[47,15,47,16],[47,19,47,20],[47,21,47,22],[47,23,47,24],[47,25,47,26],[45,29,45,35],[46,7,46,8],[46,9,46,10],[46,11,46,12],[46,13,46,14],[46,15,46,16],[46,19,46,20],[46,21,46,22],[46,23,46,24],[46,25,46,26],[45,17,45,18],[45,19,45,20],[45,21,45,22],[45,23,45,24],[45,25,45,26],[45,27,45,28],[46,27,46,28],[45,0,45,6],[45,7,45,8],[45,9,45,10],[45,11,45,12],[45,13,45,14],[45,15,45,16],[43,4,43,8],[43,12,43,16],[43,22,43,26],[40,4,40,8],[40,12,40,16],[40,22,40,26],[40,30,40,34],[43,30,43,34],[44,4,44,8],[44,12,44,16],[44,22,44,26],[44,30,44,34],[41,4,41,8],[41,12,41,16],[41,22,41,26],[41,30,41,34],[42,4,42,8],[42,12,42,16],[42,22,42,26],[42,30,42,34],[38,4,38,8],[38,12,38,16],[38,22,38,26],[34,11,34,15],[34,17,34,18],[34,20,34,24],[38,30,38,34],[39,4,39,8],[39,12,39,16],[39,22,39,26],[39,30,39,34],[35,28,36,34],[36,17,36,18],[37,4,37,8],[37,12,37,16],[37,22,37,26],[37,30,37,34],[35,2,36,8],[35,9,36,9],[30,11,30,15],[30,20,30,24],[31,11,31,15],[31,20,31,24],[35,20,36,26],[35,27,36,27],[32,11,32,15],[32,20,32,24],[33,11,33,15],[33,20,33,24],[35,10,36,16],[35,17,35,18],[27,11,27,15],[27,20,27,24],[28,11,28,15],[28,20,28,24],[29,11,29,15],[29,20,29,24],[23,16,23,19],[24,11,24,15],[24,20,24,24],[25,11,25,15],[25,20,25,24],[26,11,26,15],[26,20,26,24],[20,11,20,15],[20,20,20,24],[21,11,21,15],[21,20,21,24],[22,11,22,15],[22,20,22,24],[17,11,17,15],[17,20,17,24],[18,11,18,15],[18,20,18,24],[19,11,19,15],[19,20,19,24],[12,2,12,9],[14,30,14,31],[14,32,14,33],[14,34,14,35],[12,26,12,33],[15,11,15,15],[15,20,15,24],[16,11,16,15],[16,20,16,24],[13,32,13,33],[13,34,13,35],[13,41,13,42],[10,17,10,18],[10,21,10,22],[10,23,10,24],[8,32,8,35],[7,32,7,35],[8,1,8,10],[14,0,14,1],[14,2,14,3],[14,4,14,5],[14,6,14,7],[14,8,14,9],[14,26,14,27],[14,28,14,29],[12,41,12,42],[13,0,13,1],[13,2,13,3],[13,4,13,5],[13,6,13,7],[13,8,13,9],[13,17,13,18],[13,26,13,27],[13,28,13,29],[13,30,13,31],[7,20,11,20],[7,21,7,23],[9,12,9,14],[9,17,9,18],[8,11,8,14],[8,17,8,18],[8,22,8,31],[9,21,9,23],[7,0,7,2],[7,11,7,14],[7,15,11,15],[7,17,7,18],[10,13,10,14],[10,11,10,12],[11,17,11,18],[5,18,5,19],[5,21,5,25],[5,26,5,30],[3,31,3,35],[4,0,4,1],[4,2,6,8],[4,11,4,12],[4,18,4,19],[5,0,5,1],[5,11,5,12],[5,13,5,14],[6,0,6,1],[6,11,6,12],[5,31,5,35],[6,13,6,14],[6,18,6,19],[6,26,6,30],[1,28,2,29],[1,31,1,35],[2,0,2,1],[2,14,2,15],[2,16,2,17],[2,18,2,26],[2,31,2,35],[0,0,0,5],[0,6,0,9],[0,10,0,11],[1,0,1,1],[1,2,3,13],[1,15,1,16],[3,0,3,1],[3,14,3,15],[3,16,3,17],[3,18,3,26],[3,28,3,29]]}
["公式記録",null,null,null,null,null,"Match No：",null,null,null,31]
["大",null,"OFA 第30回 \n大分県ジュニアサッカー選手権大会\n大分県大会",null,null,null,null,null,null,null,null,null,null,null,"第",2,null,"日",null,null,null,null,null,null,null,null,null,"競技","30分",null,"記"]
["会",null,null,null,null,null,null,null,null,null,null,null,null,null,"1回戦",null,"2回戦",null,"平成30年　12月2日（日）",null,null,null,null,null,null,null,null,"時間",null,null,"録","安東　信二"]
["名",null,null,null,null,null,null,null,null,null,null,null,null,null,"準決勝",null,"決勝",null,"試合開始　11時30分～",null,null,null,null,null,null,null,null,"延長","6分",null,"者","秋吉　明"]
["会",null,"大分県大分スポーツ公園\nだいぎんサッカー・ラグビー場\nＡコート　北側",null,null,null,null,null,null,"天","晴","風",null,"強","弱","無","芝","状","良好",null,"審","主審",null,null,null,null,"副審",null,null,null,null,"第4の審判員"]
[null,null,null,null,null,null,null,null,null,null,"曇","気温",null,19,null,"℃",null,null,"不良",null,null,"宇野　耕二",null,null,null,null,"内山田　光史",null,null,null,null,"隅田　哲平"]
["場",null,null,null,null,null,null,null,null,"候","雨","湿度",null,54.1,null,"％","土","態","泥沼",null,"判",null,null,null,null,null,"菊地　謙一"]
["【チーム名】",null,null,null,null,null,null,null,null,null,null,null,null,null,null,0,0,"前半",null,0,1,"【チーム名】"]
[null,"ＭＳＳ",null,null,null,null,null,null,null,null,null,"大分市",null,null,null,null,0,"後半",null,1,null,null,"大分トリニータＵ－１２",null,null,null,null,null,null,null,null,null,"大分市"]
[null,null,null,null,null,null,null,null,null,null,null,null,"kick off",null,null,null,null,"延前",null,null,null,"kick off"]
[null,null,null,null,null,null,null,null,null,null,null,"番号",null,"PK",null,null,null,"延後",null,null,null,"PK",null,"番号"]
[null,null,null,null,null,null,null,null,null,null,null,"○","×","先","後",null,null,"ＰＫ戦",null,null,null,"先","後","○","×"]
[null,null,"シュート（得点者は○印）",null,null,null,null,null,null,null,"学",null,null,null,null,null,"番",null,null,"番",null,null,null,null,null,"学","シュート（得点者は○印）",null,null,null,null,null,null,null,null,null,null,null,null,null,null,"チーム名",null,"ＭＳＳ",null,null,null,null,null,"チーム名","大分トリニータＵ－１２"]
["合",null,"延",null,"延",null,"後",null,"前",null,null,null,"選","手","名",null,null,"位置",null,null,null,"選","手","名",null,null,"前",null,"後",null,"延",null,"延",null,"合",null,null,null,null,null,null,"地区名",null,"大分市",null,null,null,null,null,"地区名","大分市"]
["計",null,"後",null,"前",null,"半",null,"半",null,"年",null,null,null,null,null,"号",null,null,"号",null,null,null,null,null,"年","半",null,"半",null,"前",null,"後",null,"計"]
[null,0,null,null,null,null,null,null,null,null,5,"二宮　拓篤",null,null,null,null,1,"GK","GK",1,"加藤　航",null,null,null,null,5,null,null,null,null,null,null,null,null,null,0]
[null,0,null,null,null,null,null,null,null,null,5,"南里　仁士",null,null,null,null,4,"DF","DF",4,"有村　凌史郎",null,null,null,null,5,null,null,null,null,null,null,null,null,null,0]
[null,0,null,null,null,null,null,null,null,null,5,"高野　将大",null,null,null,null,14,"DF","MF",7,"染矢　宏輝",null,null,null,null,5,null,null,"①",3,null,null,null,null,null,3]
[null,1,null,null,null,null,null,null,null,1,5,"渡邊　丈輝",null,null,null,null,7,"MF","MF",14,"仲村　陽太",null,null,null,null,5,null,null,null,null,null,null,null,null,null,0]
[null,2,null,null,null,null,null,1,null,1,5,"中川　天蒼",null,null,null,null,10,"MF","MF",15,"大堀　翼颯",null,null,null,null,5,null,null,null,null,null,null,null,null,null,0]
[null,1,null,null,null,null,null,1,null,null,5,"中西　俊喜",null,null,null,null,12,"MF","FW",9,"柴田　峻徳",null,null,null,null,5,null,null,null,1,null,null,null,null,null,1]
[null,1,null,null,null,null,null,null,null,1,5,"片島　啓太",null,null,null,null,6,"FW","FW",10,"木許　央雅",null,null,null,null,5,null,null,null,null,null,null,null,null,null,0]
[null,0,null,null,null,null,null,null,null,null,5,"山本　一晟",null,null,null,null,11,"FW","FW",11,"原田　高虎",null,null,null,null,5,null,null,null,1,null,null,null,null,null,1]
[null,null,null,null,null,null,null,null,null,null,null,null,null,null,null,null,"交替要員"]
[null,0,null,null,null,null,null,null,null,null,5,"赤峰　功己",null,null,null,null,5,"FW","MF",2,"新名　巧旺",null,null,null,null,5,null,null,null,null,null,null,null,null,null,0]
[null,0,null,null,null,null,null,null,null,null,4,"後藤　塁",null,null,null,null,8,"MF","MF",3,"斉藤　晄吏",null,null,null,null,5,null,null,null,null,null,null,null,null,null,0]
[null,0,null,null,null,null,null,null,null,null,4,"石川　遥大",null,null,null,null,9,"MF","MF",5,"石本　星七",null,null,null,null,5,null,null,null,null,null,null,null,null,null,0]
[null,0,null,null,null,null,null,null,null,null,5,"吉田　光",null,null,null,null,13,"MF","MF",6,"河野　歩夢",null,null,null,null,5,null,null,null,1,null,null,null,null,null,1]
[null,0,null,null,null,null,null,null,null,null,4,"川野　公聖",null,null,null,null,15,"DF","FW",8,"後藤　慶",null,null,null,null,5,null,null,null,null,null,null,null,null,null,0]
[null,0,null,null,null,null,null,null,null,null,5,"高濱　蒼太",null,null,null,null,17,"MF","GK",1,"加藤　航",null,null,null,null,5,null,null,null,null,null,null,null,null,null,0]
[null,0,null,null,null,null,null,null,null,null,4,"高松　我空",null,null,null,null,18,"FW","MF",13,"柳田　大希",null,null,null,null,5,null,null,null,null,null,null,null,null,null,0]
[null,0,null,null,null,null,null,null,null,null,"","",null,null,null,null,null,"","FW",17,"中道　大聖",null,null,null,null,4,null,null,null,null,null,null,null,null,null,0]
[null,0,null,null,null,null,null,null,null,null,"","",null,null,null,null,null,"","",null,"",null,null,null,null,"",null,null,null,null,null,null,null,null,null,0]
[null,0,null,null,null,null,null,null,null,null,"","",null,null,null,null,null,"","",null,"",null,null,null,null,"",null,null,null,null,null,null,null,null,null,0]
[null,5,null,0,null,0,null,2,null,3,"小計",5,null,null,null,null,"合計","シュート数",null,"合計",6,null,null,null,null,"小計",null,0,null,6,null,0,null,0,null,6]
[null,null,"OUT",null,null,null,null,null,null,"→","IN",null,null,null,null,null,null,"交代",null,null,"OUT",null,null,null,null,null,null,"→","IN"]
[null,null,null,null,null,null,null,null,null,null,null,null,null,null,null,null,null,"選手"]
[null,"分",null,"番","",null,null,null,null,"→",null,"番","",null,null,null,null,null,12,"分",9,"番","柴田　峻徳",null,null,null,null,"→",6,"番","河野　歩夢"]
[null,"分",null,"番","",null,null,null,null,"→",null,"番","",null,null,null,null,null,16,"分",6,"番","河野　歩夢",null,null,null,null,"→",9,"番","柴田　峻徳"]
[null,"分",null,"番","",null,null,null,null,"→",null,"番","",null,null,null,null,null,19,"分",9,"番","柴田　峻徳",null,null,null,null,"→",6,"番","河野　歩夢"]
[null,"分",null,"番","",null,null,null,null,"→",null,"番","",null,null,null,null,null,25,"分",15,"番","大堀　翼颯",null,null,null,null,"→",9,"番","柴田　峻徳"]
[null,"分",null,"番","",null,null,null,null,"→",null,"番","",null,null,null,null,null,null,"分",null,"番","",null,null,null,null,"→",null,"番",""]
[null,"分",null,"番","",null,null,null,null,"→",null,"番","",null,null,null,null,null,null,"分",null,"番","",null,null,null,null,"→",null,"番",""]
[null,"分",null,"番","",null,null,null,null,"→",null,"番","",null,null,null,null,null,null,"分",null,"番","",null,null,null,null,"→",null,"番",""]
[null,"分",null,"番","",null,null,null,null,"→",null,"番","",null,null,null,null,null,null,"分",null,"番","",null,null,null,null,"→",null,"番",""]
["警告（Ｃ）・退場（Ｓ）など",null,null,null,null,null,null,"合計",null,"延後",null,"延前",null,"後半",null,"前半",null,"チーム\n合計",null,"前半",null,"後半",null,"延前",null,"延後",null,"合計",null,"警告（Ｃ）・退場（Ｓ）など"]
[null,null,null,null,null,null,null,8,null,null,null,null,null,5,null,3,null,"Ｇ","Ｋ",1,null,2,null,null,null,null,null,3]
[null,null,null,null,null,null,null,0,null,null,null,null,null,0,null,0,null,"Ｃ","Ｋ",1,null,1,null,null,null,null,null,2]
[null,null,null,null,null,null,null,3,null,null,null,null,null,2,null,1,null,"直接","ＦＫ",2,null,2,null,null,null,null,null,4]
[null,null,null,null,null,null,null,1,null,null,null,null,null,1,null,0,null,"間接","ＦＫ",1,null,1,null,null,null,null,null,2]
[null,null,null,null,null,null,null,0,null,null,null,null,null,0,null,0,null,"Ｐ","Ｋ",0,null,0,null,null,null,null,null,0]
["時間",null,null,"得点者",null,"得　　点　　経　　過",null,null,null,null,null,null,null,null,null,null,null,null,"時間",null,null,"得点者",null,"得　　点　　経　　過"]
[null,null,"分",null,null,null,null,null,null,null,null,null,null,null,null,null,null,null,null,26,"分",7,null,"６　→　７Ｓ"]
[null,null,"分",null,null,null,null,null,null,null,null,null,null,null,null,null,null,null,null,null,"分"]
[null,null,"分",null,null,null,null,null,null,null,null,null,null,null,null,null,null,null,null,null,"分"]
[null,null,"分",null,null,null,null,null,null,null,null,null,null,null,null,null,null,null,null,null,"分"]
[null,null,"分",null,null,null,null,null,null,null,null,null,null,null,null,null,null,null,null,null,"分"]
[null,null,"分",null,null,null,null,null,null,null,null,null,null,null,null,null,null,null,null,null,"分"]
[" ",null,null,"《略号例》",null,null,null,"ドリブル",null,"～",null,"ゴロのパス",null,null,"→",null,"浮き球",null,"∩",null,"混戦",null,"×",null,"ヘディング",null,null,"H",null,"シュート",null,"S"]
[]
["戦評者氏名",null,null,null,"（",null,null,null,null,null,"）",null,"勤務先または所属",null,null,null,null,"（","一般社団法人　大分県サッカー協会　技術委員会",null,null,null,null,null,null,null,null,null,null,null,null,null,null,null,"　）"]
[]
[]
[]
[]
[]
[]
[]
[]
[null,null,null,null,null,null,"M   C",null,null,null,null,null,null,"会　場　長",null,null,null,null,null,null,"ウェルフェアオフィサー",null,null,null,null,null,null,"主　　審"]
[null,null,null,null,null,null,"中原　圭介",null,null,null,null,null,null,"津守　一雄",null,null,null,null,null,null,"中野　観司郎",null,null,null,null,null,null,"宇野　耕二"]

{"sheet":"決勝公式記録 No,33","index":16,"n_rows":71,"n_cols":51,"rows_kept":71,"cut":false,"hidden":false,"merged":[[69,13,69,19],[69,20,69,26],[69,27,69,35],[70,13,72,19],[70,20,72,26],[70,27,72,35],[58,29,58,30],[60,0,60,3],[60,5,60,9],[60,12,60,16],[60,18,60,33],[61,0,67,35],[58,3,58,5],[58,7,58,8],[58,11,58,13],[58,16,58,17],[58,20,58,21],[58,24,58,26],[69,6,69,12],[70,6,72,12],[56,3,56,4],[56,5,56,17],[56,21,56,22],[56,23,56,35],[57,3,57,4],[57,5,57,17],[57,21,57,22],[57,23,57,35],[54,3,54,4],[54,5,54,17],[54,21,54,22],[54,23,54,35],[55,3,55,4],[55,5,55,17],[55,21,55,22],[55,23,55,35],[52,3,52,4],[52,5,52,17],[52,21,52,22],[52,23,52,35],[53,3,53,4],[53,5,53,17],[53,21,53,22],[53,23,53,35],[50,27,50,28],[51,0,51,2],[51,3,51,4],[51,5,51,17],[51,18,51,20],[51,21,51,22],[51,23,51,35],[49,27,49,28],[50,7,50,8],[50,9,50,10],[50,11,50,12],[50,13,50,14],[50,15,50,16],[50,19,50,20],[50,21,50,22],[50,23,50,24],[50,25,50,26],[49,7,49,8],[49,9,49,10],[49,11,49,12],[49,13,49,14],[49,15,49,16],[49,19,49,20],[49,21,49,22],[49,23,49,24],[49,25,49,26],[47,27,47,28],[48,7,48,8],[48,9,48,10],[48,11,48,12],[48,13,48,14],[48,15,48,16],[48,19,48,20],[48,21,48,22],[48,23,48,24],[48,25,48,26],[48,27,48,28],[47,7,47,8],[47,9,47,10],[47,11,47,12],[47,13,47,14],[47,15,47,16],[47,19,47,20],[47,21,47,22],[47,23,47,24],[47,25,47,26],[45,29,45,35],[46,7,46,8],[46,9,46,10],[46,11,46,12],[46,13,46,14],[46,15,46,16],[46,19,46,20],[46,21,46,22],[46,23,46,24],[46,25,46,26],[45,17,45,18],[45,19,45,20],[45,21,45,22],[45,23,45,24],[45,25,45,26],[45,27,45,28],[46,27,46,28],[45,0,45,6],[45,7,45,8],[45,9,45,10],[45,11,45,12],[45,13,45,14],[45,15,45,16],[43,4,43,8],[43,12,43,16],[43,22,43,26],[40,4,40,8],[40,12,40,16],[40,22,40,26],[40,30,40,34],[43,30,43,34],[44,4,44,8],[44,12,44,16],[44,22,44,26],[44,30,44,34],[41,4,41,8],[41,12,41,16],[41,22,41,26],[41,30,41,34],[42,4,42,8],[42,12,42,16],[42,22,42,26],[42,30,42,34],[38,4,38,8],[38,12,38,16],[38,22,38,26],[34,11,34,15],[34,17,34,18],[34,20,34,24],[38,30,38,34],[39,4,39,8],[39,12,39,16],[39,22,39,26],[39,30,39,34],[35,28,36,34],[36,17,36,18],[37,4,37,8],[37,12,37,16],[37,22,37,26],[37,30,37,34],[35,2,36,8],[35,9,36,9],[30,11,30,15],[30,20,30,24],[31,11,31,15],[31,20,31,24],[35,20,36,26],[35,27,36,27],[32,11,32,15],[32,20,32,24],[33,11,33,15],[33,20,33,24],[35,10,36,16],[35,17,35,18],[27,11,27,15],[27,20,27,24],[28,11,28,15],[28,20,28,24],[29,11,29,15],[29,20,29,24],[23,16,23,19],[24,11,24,15],[24,20,24,24],[25,11,25,15],[25,20,25,24],[26,11,26,15],[26,20,26,24],[20,11,20,15],[20,20,20,24],[21,11,21,15],[21,20,21,24],[22,11,22,15],[22,20,22,24],[17,11,17,15],[17,20,17,24],[18,11,18,15],[18,20,18,24],[19,11,19,15],[19,20,19,24],[12,2,12,9],[14,30,14,31],[14,32,14,33],[14,34,14,35],[12,26,12,33],[15,11,15,15],[15,20,15,24],[16,11,16,15],[16,20,16,24],[13,32,13,33],[13,34,13,35],[13,41,13,42],[10,17,10,18],[10,21,10,22],[10,23,10,24],[8,32,8,35],[7,32,7,35],[8,1,8,10],[14,0,14,1],[14,2,14,3],[14,4,14,5],[14,6,14,7],[14,8,14,9],[14,26,14,27],[14,28,14,29],[12,41,12,42],[13,0,13,1],[13,2,13,3],[13,4,13,5],[13,6,13,7],[13,8,13,9],[13,17,13,18],[13,26,13,27],[13,28,13,29],[13,30,13,31],[7,20,11,20],[7,21,7,23],[9,12,9,14],[9,17,9,18],[8,11,8,14],[8,17,8,18],[8,22,8,31],[9,21,9,23],[7,0,7,2],[7,11,7,14],[7,15,11,15],[7,17,7,18],[10,13,10,14],[10,11,10,12],[11,17,11,18],[5,18,5,19],[5,21,5,25],[5,26,5,30],[3,31,3,35],[4,0,4,1],[4,2,6,8],[4,11,4,12],[4,18,4,19],[5,0,5,1],[5,11,5,12],[5,13,5,14],[6,0,6,1],[6,11,6,12],[5,31,5,35],[6,13,6,14],[6,18,6,19],[6,26,6,30],[1,28,2,29],[1,31,1,35],[2,0,2,1],[2,14,2,15],[2,16,2,17],[2,18,2,26],[2,31,2,35],[0,0,0,5],[0,6,0,9],[0,10,0,11],[1,0,1,1],[1,2,3,13],[1,15,1,16],[3,0,3,1],[3,14,3,15],[3,16,3,17],[3,18,3,26],[3,28,3,29]]}
["公式記録",null,null,null,null,null,"Match No：",null,null,null,33]
["大",null,"OFA 第30回 \n大分県ジュニアサッカー選手権大会\n大分県大会",null,null,null,null,null,null,null,null,null,null,null,"第",2,null,"日",null,null,null,null,null,null,null,null,null,"競技","30分",null,"記"]
["会",null,null,null,null,null,null,null,null,null,null,null,null,null,"1回戦",null,"2回戦",null,"平成30年　12月2日（日）",null,null,null,null,null,null,null,null,"時間",null,null,"録","松下　省吾"]
["名",null,null,null,null,null,null,null,null,null,null,null,null,null,"準決勝",null,"決勝",null,"試合開始　13時30分～",null,null,null,null,null,null,null,null,"延長","6分",null,"者","中原　圭介"]
["会",null,"大分県大分スポーツ公園\nだいぎんサッカー・ラグビー場\nＡコート　北側",null,null,null,null,null,null,"天","晴","風",null,"強","弱","無","芝","状","良好",null,"審","主審",null,null,null,null,"副審",null,null,null,null,"第4の審判員"]
[null,null,null,null,null,null,null,null,null,null,"曇","気温",null,16,null,"℃",null,null,"不良",null,null,"寺林　豊",null,null,null,null,"矢野　三千生",null,null,null,null,"足立　卓也"]
["場",null,null,null,null,null,null,null,null,"候","雨","湿度",null,64.900000000000006,null,"％","土","態","泥沼",null,"判",null,null,null,null,null,"佐藤　慎二"]
["【チーム名】",null,null,null,null,null,null,null,null,null,null,null,null,null,null,0,0,"前半",null,0,2,"【チーム名】"]
[null,"スマイス・セレソン",null,null,null,null,null,null,null,null,null,"別府市",null,null,null,null,0,"後半",null,2,null,null,"大分トリニータＵ－１２",null,null,null,null,null,null,null,null,null,"大分市"]
[null,null,null,null,null,null,null,null,null,null,null,null,"kick off",null,null,null,null,"延前",null,null,null,"kick off"]
[null,null,null,null,null,null,null,null,null,null,null,"番号",null,"PK",null,null,null,"延後",null,null,null,"PK",null,"番号"]
[null,null,null,null,null,null,null,null,null,null,null,"○","×","先","後",null,null,"ＰＫ戦",null,null,null,"先","後","○","×"]
[null,null,"シュート（得点者は○印）",null,null,null,null,null,null,null,"学",null,null,null,null,null,"番",null,null,"番",null,null,null,null,null,"学","シュート（得点者は○印）",null,null,null,null,null,null,null,null,null,null,null,null,null,null,"チーム名",null,"スマイス・セレソン",null,null,null,null,null,"チーム名","大分トリニータＵ－１２"]
["合",null,"延",null,"延",null,"後",null,"前",null,null,null,"選","手","名",null,null,"位置",null,null,null,"選","手","名",null,null,"前",null,"後",null,"延",null,"延",null,"合",null,null,null,null,null,null,"地区名",null,"別府市",null,null,null,null,null,"地区名","大分市"]
["計",null,"後",null,"前",null,"半",null,"半",null,"年",null,null,null,null,null,"号",null,null,"号",null,null,null,null,null,"年","半",null,"半",null,"前",null,"後",null,"計"]
[null,0,null,null,null,null,null,null,null,null,5,"阿部　巧翔",null,null,null,null,1,"GK","GK",1,"加藤　航",null,null,null,null,5,null,null,null,null,null,null,null,null,null,0]
[null,0,null,null,null,null,null,null,null,null,5,"渡辺　陽星",null,null,null,null,2,"DF","DF",4,"有村　凌史郎",null,null,null,null,5,null,null,null,null,null,null,null,null,null,0]
[null,0,null,null,null,null,null,null,null,null,5,"土井　純音",null,null,null,null,3,"DF","MF",6,"河野　歩夢",null,null,null,null,5,null,null,"①",1,null,null,null,null,null,1]
[null,0,null,null,null,null,null,null,null,null,4,"原田　煌也",null,null,null,null,4,"DF","MF",7,"染矢　宏輝",null,null,null,null,5,null,1,null,null,null,null,null,null,null,1]
[null,0,null,null,null,null,null,null,null,null,5,"石川　巧翔",null,null,null,null,5,"DF","MF",14,"仲村　陽太",null,null,null,null,5,null,null,null,null,null,null,null,null,null,0]
[null,0,null,null,null,null,null,null,null,null,5,"小野　陽士",null,null,null,null,7,"MF","FW",9,"柴田　峻徳",null,null,null,null,5,null,null,null,null,null,null,null,null,null,0]
[null,0,null,null,null,null,null,null,null,null,5,"財前　大翔",null,null,null,null,6,"FW","FW",10,"木許　央雅",null,null,null,null,5,null,null,"①",2,null,null,null,null,null,2]
[null,2,null,null,null,null,null,1,null,1,5,"大室　響",null,null,null,null,10,"FW","FW",11,"原田　高虎",null,null,null,null,5,null,2,null,3,null,null,null,null,null,5]
[null,null,null,null,null,null,null,null,null,null,null,null,null,null,null,null,"交替要員"]
[null,0,null,null,null,null,null,null,null,null,4,"佐々木　大和",null,null,null,null,8,"FW","MF",2,"新名　巧旺",null,null,null,null,5,null,null,null,null,null,null,null,null,null,0]
[null,0,null,null,null,null,null,null,null,null,4,"横田　啓",null,null,null,null,9,"MF","MF",3,"斉藤　晄吏",null,null,null,null,5,null,null,null,1,null,null,null,null,null,1]
[null,0,null,null,null,null,null,null,null,null,5,"膳瀬　晃希",null,null,null,null,11,"MF","MF",5,"石本　星七",null,null,null,null,5,null,null,null,null,null,null,null,null,null,0]
[null,0,null,null,null,null,null,null,null,null,5,"伊藤　迅世",null,null,null,null,12,"DF","FW",8,"後藤　慶",null,null,null,null,5,null,null,null,null,null,null,null,null,null,0]
[null,0,null,null,null,null,null,null,null,null,5,"堤　一惺",null,null,null,null,13,"MF","GK",12,"桑原　颯太",null,null,null,null,5,null,null,null,null,null,null,null,null,null,0]
[null,0,null,null,null,null,null,null,null,null,4,"岩崎　蓮武",null,null,null,null,14,"MF","MF",13,"柳田　大希",null,null,null,null,5,null,null,null,null,null,null,null,null,null,0]
[null,0,null,null,null,null,null,null,null,null,4,"安部　颯",null,null,null,null,15,"FW","MF",15,"大堀　翼颯",null,null,null,null,5,null,null,null,null,null,null,null,null,null,0]
[null,0,null,null,null,null,null,null,null,null,5,"赤野　陽亮",null,null,null,null,16,"GK","FW",17,"中道　大聖",null,null,null,null,4,null,null,null,null,null,null,null,null,null,0]
[null,0,null,null,null,null,null,null,null,null,"","",null,null,null,null,null,"","",null,"",null,null,null,null,"",null,null,null,null,null,null,null,null,null,0]
[null,0,null,null,null,null,null,null,null,null,"","",null,null,null,null,null,"","",null,"",null,null,null,null,"",null,null,null,null,null,null,null,null,null,0]
[null,2,null,0,null,0,null,1,null,1,"小計",2,null,null,null,null,"合計","シュート数",null,"合計",10,null,null,null,null,"小計",null,3,null,7,null,0,null,0,null,10]
[null,null,"OUT",null,null,null,null,null,null,"→","IN",null,null,null,null,null,null,"交代",null,null,"OUT",null,null,null,null,null,null,"→","IN"]
[null,null,null,null,null,null,null,null,null,null,null,null,null,null,null,null,null,"選手"]
[null,"分",null,"番","",null,null,null,null,"→",null,"番","",null,null,null,null,null,12,"分",9,"番","柴田　峻徳",null,null,null,null,"→",15,"番","大堀　翼颯"]
[null,"分",null,"番","",null,null,null,null,"→",null,"番","",null,null,null,null,null,28,"分",15,"番","大堀　翼颯",null,null,null,null,"→",3,"番","斉藤　晄吏"]
[null,"分",null,"番","",null,null,null,null,"→",null,"番","",null,null,null,null,null,null,"分",null,"番","",null,null,null,null,"→",null,"番",""]
[null,"分",null,"番","",null,null,null,null,"→",null,"番","",null,null,null,null,null,null,"分",null,"番","",null,null,null,null,"→",null,"番",""]
[null,"分",null,"番","",null,null,null,null,"→",null,"番","",null,null,null,null,null,null,"分",null,"番","",null,null,null,null,"→",null,"番",""]
[null,"分",null,"番","",null,null,null,null,"→",null,"番","",null,null,null,null,null,null,"分",null,"番","",null,null,null,null,"→",null,"番",""]
[null,"分",null,"番","",null,null,null,null,"→",null,"番","",null,null,null,null,null,null,"分",null,"番","",null,null,null,null,"→",null,"番",""]
[null,"分",null,"番","",null,null,null,null,"→",null,"番","",null,null,null,null,null,null,"分",null,"番","",null,null,null,null,"→",null,"番",""]
["警告（Ｃ）・退場（Ｓ）など",null,null,null,null,null,null,"合計",null,"延後",null,"延前",null,"後半",null,"前半",null,"チーム\n合計",null,"前半",null,"後半",null,"延前",null,"延後",null,"合計",null,"警告（Ｃ）・退場（Ｓ）など"]
[null,null,null,null,null,null,null,5,null,null,null,null,null,3,null,2,null,"Ｇ","Ｋ",1,null,2,null,null,null,null,null,3]
[null,null,null,null,null,null,null,1,null,null,null,null,null,0,null,1,null,"Ｃ","Ｋ",2,null,3,null,null,null,null,null,5]
[null,null,null,null,null,null,null,5,null,null,null,null,null,4,null,1,null,"直接","ＦＫ",1,null,0,null,null,null,null,null,1]
[null,null,null,null,null,null,null,2,null,null,null,null,null,2,null,0,null,"間接","ＦＫ",0,null,0,null,null,null,null,null,0]
[null,null,null,null,null,null,null,0,null,null,null,null,null,0,null,0,null,"Ｐ","Ｋ",0,null,0,null,null,null,null,null,0]
["時間",null,null,"得点者",null,"得　　点　　経　　過",null,null,null,null,null,null,null,null,null,null,null,null,"時間",null,null,"得点者",null,"得　　点　　経　　過"]
[null,null,"分",null,null,null,null,null,null,null,null,null,null,null,null,null,null,null,null,18,"分",10,null,"１０Ｓ"]
[null,null,"分",null,null,null,null,null,null,null,null,null,null,null,null,null,null,null,null,19,"分",6,null,"４　→　６～Ｓ"]
[null,null,"分",null,null,null,null,null,null,null,null,null,null,null,null,null,null,null,null,null,"分"]
[null,null,"分",null,null,null,null,null,null,null,null,null,null,null,null,null,null,null,null,null,"分"]
[null,null,"分",null,null,null,null,null,null,null,null,null,null,null,null,null,null,null,null,null,"分"]
[null,null,"分",null,null,null,null,null,null,null,null,null,null,null,null,null,null,null,null,null,"分"]
[" ",null,null,"《略号例》",null,null,null,"ドリブル",null,"～",null,"ゴロのパス",null,null,"→",null,"浮き球",null,"∩",null,"混戦",null,"×",null,"ヘディング",null,null,"H",null,"シュート",null,"S"]
[]
["戦評者氏名",null,null,null,"（","伊東　雅弘",null,null,null,null,"）",null,"勤務先または所属",null,null,null,null,"（","一般社団法人　大分県サッカー協会　ジュニア委員会",null,null,null,null,null,null,null,null,null,null,null,null,null,null,null,"　）"]
["　前半、スマイス・セレソンは、大分トリニータＵ－１２のDF背後をロングパスで狙う展開。一方、大分トリニータＵ－１２は、中央から両サイドへスルーパス、そこから中へクロスボールを送りシュートを狙う展開。両チーム共、決定機を作れず無得点で前半終了。\n　後半は、18分に大分トリニータＵ－１２のコーナーキックをスマイス・セレソンがクリアしたボールに、10番 木許　央雅 君が反応し、右足でロングシュートを決め、均衡を破る。19分にも、大分トリニータＵ－１２ 4番 有村　凌史郎 君が中央をドリブルで持ち上がり、横から上がってきた、6番 河野　歩夢 君にパスをし、ミドルシュートにて追加点を上げる。スマイス・セレソンも、10番 大室　響 君をトップに上げてボールを集め、攻撃をしかけるも得点に繋がらず、2-0で大分トリニータＵ－１２の優勝で試合終了。"]
[]
[]
[]
[]
[]
[]
[]
[null,null,null,null,null,null,"M   C",null,null,null,null,null,null,"会　場　長",null,null,null,null,null,null,"ウェルフェアオフィサー",null,null,null,null,null,null,"主　　審"]
[null,null,null,null,null,null,"安東　幹雄",null,null,null,null,null,null,"津守　一雄",null,null,null,null,null,null,"山野内　哲朗",null,null,null,null,null,null,"寺林　豊"]

{"sheet":"審判員","index":17,"n_rows":680,"n_cols":11,"rows_kept":680,"cut":false,"hidden":true,"merged":[]}
["審判登録番号","氏名","資格","性別","技能区分","所属協会","第二登録協会",null,"選択肢より",null,"＜警告選択肢＞"]
["R010247516","草場　帆斗","3級","男性","S審判","長崎県","大分県",null,"警告",null,"反スポ"]
["R001262704","緒方　孝浩","1級","男性","S審判","大分県",null,null,"退場",null,"ラフ"]
["R001251601","佐々木　慎哉","1級","男性","S審判","大分県",null,null,null,null,"異議"]
["R003147861","緒方　実央","女子1級","女性","S審判","大分県",null,null,null,null,"繰り返し"]
["R001265145","秋元　昭一","2級","男性","S審判","大分県",null,null,null,null,"遅延"]
["R000879756","足達　実生","2級","男性","S審判","大分県",null,null,null,null,"距離"]
["R001253502","安藤　博幸","2級","男性","S審判","大分県",null,null,null,null,"無断入"]
["R006221377","池添　将大","2級","男性","S審判","大分県",null,null,null,null,"無断去"]
["R001262333","諌本　秀樹","2級","男性","S審判","大分県",null,null,null,null,"＜退場選択肢＞"]
["R001254060","井上　大知","2級","男性","S審判","大分県",null,null,null,null,"不正"]
["R001265172","岩尾　雅広","2級","男性","S審判","大分県",null,null,null,null,"乱暴"]
["R001262546","岩崎　浩也","2級","男性","S審判","大分県",null,null,null,null,"つば"]
["R001265190","宇野　耕二","2級","男性","S審判","大分県",null,null,null,null,"阻止(手)"]
["R001265224","大塚　浩司","2級","男性","S審判","大分県",null,null,null,null,"阻止(他)"]
["R001265233","大野　髙洋","2級","男性","S審判","大分県",null,null,null,null,"暴言"]
["R001265242","小埜　勝也","2級","男性","S審判","大分県",null,null,null,null,"警告2"]
["R009212325","戒田　直樹","2級","男性","S審判","大分県"]
["R004281658","兼瀬　健志","2級","男性","S審判","大分県"]
["R001265303","河野　紘祐","2級","男性","S審判","大分県"]
["R001262971","木下　富喜","2級","男性","S審判","大分県"]
["R001262999","木原　一心","2級","男性","S審判","大分県"]
["R005528255","黒田　大貴","2級","男性","S審判","大分県"]
["R001265330","桑名　隆","2級","男性","S審判","大分県"]
["R001265349","小出　康博","2級","男性","S審判","大分県"]
["R010020561","小林　遥香","2級","女性","S審判","大分県","熊本県"]
["R001265376","後藤　樹明","2級","男性","S審判","大分県"]
["R000876616","後藤　晋平","2級","男性","S審判","大分県"]
["R001265367","後藤　啓之","2級","男性","S審判","大分県"]
["R001256943","笹原　年浩","2級","男性","S審判","大分県"]
["R003255841","塩月　勇輝","2級","男性","S審判","大分県"]
["R001265385","須藤　健二","2級","男性","S審判","大分県"]
["R001257818","関　太啓","2級","男性","S審判","大分県"]
["R006221465","曽我　拓実","2級","男性","S審判","大分県"]
["R010052667","高木　翔","2級","男性","S審判","大分県"]
["R001257924","高木　哲也","2級","男性","S審判","大分県"]
["R000892429","田中　博","2級","男性","S審判","大分県"]
["R001265428","坪井　和幸","2級","男性","S審判","大分県"]
["R001265437","寺林　豊","2級","男性","S審判","大分県"]
["R008254236","時髙　美紅","2級","女性","S審判","大分県","山口県"]
["R001265455","中井　賢太郎","2級","男性","S審判","大分県"]
["R006151032","中尾　優志","2級","男性","S審判","大分県"]
["R003317390","中園　健太郎","2級","男性","S審判","大分県"]
["R004162335","中原　元希","2級","男性","S審判","大分県"]
["R001265464","仲摩　則孝","2級","男性","S審判","大分県"]
["R001265297","中村　圭一郎","2級","男性","S審判","大分県"]
["R001265358","西田　亜矢","2級","女性","S審判","大分県"]
["R001265473","引地　弘幸","2級","男性","S審判","大分県"]
["R001260140","福田　人志","2級","男性","S審判","大分県"]
["R001265516","藤田　昭彦","2級","男性","S審判","大分県"]
["R001265534","前山　精治","2級","男性","S審判","大分県"]
["R001260593","増永　伸也","2級","男性","S審判","大分県"]
["R001265552","松原　マヤ","2級","女性","S審判","大分県"]
["R002331010","丸小野　聡暢","2級","男性","S審判","大分県"]
["R004793649","水江　真太郎","2級","男性","S審判","大分県"]
["R001264632","湊　弘智","2級","男性","S審判","大分県"]
["R006093817","幸　壮一郎","2級","男性","S審判","大分県"]
["R001265622","渡邉　昇","2級","男性","S審判","大分県"]
["R001262023","和田　敬生","2級","男性","S審判","大分県"]
["R007728956","秋鹿　栄","3級","男性","S審判","大分県"]
["R009072286","合澤　早紀","3級","女性","S審判","大分県"]
["R010093434","赤嶺　将太","3級","男性","S審判","大分県"]
["R001264881","赤山　千晶","3級","男性","S審判","大分県"]
["R001253007","秋元　貴生","3級","男性","S審判","大分県"]
["R001253025","秋吉　明","3級","男性","S審判","大分県"]
["R007960093","浅井　佑太","3級","男性","S審判","大分県"]
["R007728424","浅田　雄太","3級","男性","S審判","大分県"]
["R003972391","朝比奈　義行","3級","男性","S審判","大分県"]
["R003317336","朝吹　崇宏","3級","男性","S審判","大分県"]
["R006933694","東　紘造","3級","男性","S審判","大分県"]
["R009072152","麻生　葵","3級","女性","S審判","大分県"]
["R001253159","麻生　勝稔","3級","男性","S審判","大分県"]
["R001265154","足立　英二","3級","男性","S審判","大分県"]
["R001253557","安達　信也","3級","男性","S審判","大分県"]
["R001253195","足立　淳","3級","男性","S審判","大分県"]
["R010069871","足立　卓也","3級","男性","S審判","大分県"]
["R009198423","足立　光","3級","男性","S審判","大分県"]
["R010189040","阿地　孝","3級","男性","S審判","大分県"]
["R010044664","穴井　裕大","3級","男性","S審判","大分県"]
["R001262184","安部　一徳","3級","男性","S審判","大分県"]
["R006573784","安倍　和広","3級","男性","S審判","大分県"]
["R009460436","安部　隆行","3級","男性","S審判","大分県"]
["R010189323","安部　孝之","3級","男性","S審判","大分県"]
["R007959103","安倍　達也","3級","男性","S審判","大分県"]
["R001262209","阿部　浩之","3級","男性","S審判","大分県"]
["R010281814","安部　正信","3級","男性","S審判","大分県"]
["R010027828","阿部　涼","3級","男性","S審判","大分県"]
["R005336098","荒木　宗明","3級","男性","S審判","大分県"]
["R004225713","有田　裕哉","3級","男性","S審判","大分県"]
["R001251036","有村　季幸","3級","男性","S審判","大分県"]
["R001262236","有吉　剛","3級","男性","S審判","大分県"]
["R008634229","安藤　昭徳","3級","男性","S審判","大分県"]
["R007003033","安藤　和洋","3級","男性","S審判","大分県"]
["R001253496","安東　信二","3級","男性","S審判","大分県"]
["R010013254","安藤　暢","3級","男性","S審判","大分県"]
["R010064829","安藤　英明","3級","男性","S審判","大分県"]
["R001253548","安藤　洋樹","3級","男性","S審判","大分県"]
["R001262254","安東　幹雄","3級","男性","S審判","大分県"]
["R009547124","安藤　洋一","3級","男性","S審判","大分県"]
["R007960084","安部　武志","3級","男性","S審判","大分県"]
["R001262290","池江　浩一郎","3級","男性","S審判","大分県"]
["R002384216","池田　浩","3級","男性","S審判","大分県"]
["R001262324","池辺　俊明","3級","男性","S審判","大分県"]
["R009408904","石井　洋平","3級","男性","S審判","大分県"]
["R001262360","石川　幸二","3級","男性","S審判","大分県"]
["R001262379","石川　慎也","3級","男性","S審判","大分県"]
["R004060329","石松　卓哉","3級","男性","S審判","大分県"]
["R001262397","石丸　泰幸","3級","男性","S審判","大分県"]
["R007753129","石本　直也","3級","男性","S審判","大分県"]
["R001262403","石山　慎史","3級","男性","S審判","大分県"]
["R003421338","五十川　文明","3級","男性","S審判","大分県"]
["R005467918","磯村　信一","3級","男性","S審判","大分県"]
["R008536972","板井　晋一","3級","男性","S審判","大分県"]
["R006093835","板井　龍法","3級","男性","S審判","大分県"]
["R006151041","板倉　瑛希","3級","男性","S審判","大分県"]
["R007686234","市田　翔太","3級","男性","S審判","大分県"]
["R002384191","居塚　繁","3級","男性","S審判","大分県"]
["R002531522","伊藤　宏充","3級","男性","S審判","大分県"]
["R001262458","伊東　雅弘","3級","男性","S審判","大分県"]
["R008634478","伊藤　勇士","3級","女性","S審判","大分県"]
["R006173919","井上　健次郎","3級","男性","S審判","大分県"]
["R004653262","井上　誠一","3級","男性","S審判","大分県"]
["R010281875","井上　颯太","3級","男性","S審判","大分県"]
["R001254051","井上　直樹","3級","男性","S審判","大分県"]
["R001869093","井上　秀文","3級","男性","S審判","大分県"]
["R006574172","猪下　侑恭","3級","男性","S審判","大分県"]
["R001262485","猪原　勝彦","3級","男性","S審判","大分県"]
["R001262494","井堀　貴康","3級","男性","S審判","大分県"]
["R001262500","今井　克人","3級","男性","S審判","大分県"]
["R003677104","今宮　俊一","3級","男性","S審判","大分県"]
["R010090347","岩男　行祐","3級","男性","S審判","大分県"]
["R005603820","岩尾　潤一郎","3級","男性","S審判","大分県"]
["R010096810","岩尾　瑞貴","3級","男性","S審判","大分県"]
["R006664758","岩男　雄一郎","3級","男性","S審判","大分県"]
["R001254176","岩坂　康範","3級","男性","S審判","大分県"]
["R004778507","岩崎　彰範","3級","男性","S審判","大分県"]
["R005405510","岩崎　皓太郎","3級","男性","S審判","大分県"]
["R005405529","岩崎　裕太郎","3級","男性","S審判","大分県"]
["R010100667","岩波　豊治","3級","男性","S審判","大分県"]
["R002384605","岩野　雄二","3級","男性","S審判","大分県"]
["R007335297","岩丸　海斗","3級","男性","S審判","大分県"]
["R008634830","岩村　真斗","3級","男性","S審判","大分県"]
["R001262573","上尾　泰裕","3級","男性","S審判","大分県"]
["R004055390","植木　邦彦","3級","男性","S審判","大分県"]
["R001254282","上田　大吾","3級","男性","S審判","大分県"]
["R001262582","上田　輝彦","3級","男性","S審判","大分県"]
["R010169040","上本　慎一郎","3級","男性","S審判","大分県"]
["R009408773","植山　功喜","3級","男性","S審判","大分県"]
["R010189280","魚住　健人","3級","男性","S審判","大分県"]
["R010172862","牛島　寛明","3級","男性","S審判","大分県"]
["R007003431","宇髙　篤史","3級","男性","S審判","大分県"]
["R003421231","内丸　貴裕","3級","男性","S審判","大分県"]
["R010264274","内村　天翔","3級","男性","S審判","大分県"]
["R010093443","内山田　光史","3級","男性","S審判","大分県"]
["R001262874","宇都宮　潤也","3級","男性","S審判","大分県"]
["R005527609","宇都宮　貴之","3級","男性","S審判","大分県"]
["R010189311","梅徳　里一","3級","男性","S審判","大分県"]
["R003421161","永路　尚道","3級","男性","S審判","大分県"]
["R010076621","江上　和希","3級","男性","S審判","大分県"]
["R005603361","江口　晃平","3級","男性","S審判","大分県"]
["R010281880","江口　大介","3級","男性","S審判","大分県"]
["R002530064","江崎　康平","3級","男性","S審判","大分県"]
["R001254538","江藤　修","3級","男性","S審判","大分県"]
["R005603866","衛藤　圭典","3級","男性","S審判","大分県"]
["R001254510","衛藤　兼一","3級","男性","S審判","大分県"]
["R001262607","衛藤　俊明","3級","男性","S審判","大分県"]
["R001254477","江藤　雅章","3級","男性","S審判","大分県"]
["R009197619","恵美　圭介","3級","男性","S審判","大分県"]
["R002384580","江良　信司","3級","男性","S審判","大分県"]
["R001262625","大久保　邦彦","3級","男性","S審判","大分県"]
["R008377616","大久保　稔生","3級","男性","S審判","大分県"]
["R006093738","大谷　伸二","3級","男性","S審判","大分県"]
["R001254714","大塚　浩介","3級","男性","S審判","大分県"]
["R005528121","大塚　勇司","3級","男性","S審判","大分県"]
["R008174019","大塚　良輝","3級","男性","S審判","大分県"]
["R003351109","大津留　健太","3級","男性","S審判","大分県"]
["R003317080","大津留　聖太","3級","男性","S審判","大分県"]
["R001262670","大渡　年春","3級","男性","S審判","大分県"]
["R007686261","大友　拓郎","3級","男性","S審判","大分県"]
["R003421222","大野　盛通","3級","男性","S審判","大分県"]
["R008523330","大場　剛","3級","男性","S審判","大分県"]
["R010093494","大本　敏行","3級","男性","S審判","大分県"]
["R007660573","岡　智史","3級","男性","S審判","大分県"]
["R006901613","岡部　明男","3級","男性","S審判","大分県"]
["R001254875","岡部　司","3級","男性","S審判","大分県"]
["R007959088","岡本　遼","3級","男性","S審判","大分県"]
["R001262698","緒方　崇","3級","男性","S審判","大分県"]
["R007075261","小川　翔太","3級","男性","S審判","大分県"]
["R006573979","小川　雅和","3級","男性","S審判","大分県"]
["R009460515","奥田　和彦","3級","男性","S審判","大分県"]
["R003972355","小倉　正広","3級","男性","S審判","大分県"]
["R001262731","長田　敏明","3級","男性","S審判","大分県"]
["R010189320","尾崎　勇","3級","男性","S審判","大分県"]
["R007960109","小田　将大","3級","男性","S審判","大分県"]
["R010311884","越智　龍平","3級","男性","S審判","大分県"]
["R002996695","乙部　哲也","3級","男性","S審判","大分県"]
["R007959954","オトメ　仁孝","3級","男性","S審判","大分県"]
["R002917661","小野　晃央","3級","男性","S審判","大分県"]
["R001262768","小野　和生","3級","男性","S審判","大分県"]
["R001255184","小野　聡","3級","男性","S審判","大分県"]
["R005603608","小野　智史","3級","男性","S審判","大分県"]
["R001255193","小野　修太郎","3級","男性","S審判","大分県"]
["R001262759","小野　俊二郎","3級","男性","S審判","大分県"]
["R001255139","小野　慎一","3級","男性","S審判","大分県"]
["R001262740","小野　辰弘","3級","男性","S審判","大分県"]
["R005604005","小野　裕二","3級","男性","S審判","大分県"]
["R010027814","小野　優也","3級","男性","S審判","大分県"]
["R001262786","小野　幸登","3級","男性","S審判","大分県"]
["R001262777","小野　亮一","3級","男性","S審判","大分県"]
["R002996659","小畑　郁夫","3級","男性","S審判","大分県"]
["R005164303","小幡　栄治","3級","男性","S審判","大分県"]
["R000466941","小畑　克則","3級","男性","S審判","大分県"]
["R002530125","小畑　広大","3級","男性","S審判","大分県"]
["R008173700","甲斐　剛樹","3級","男性","S審判","大分県"]
["R001265260","甲斐　正三","3級","男性","S審判","大分県"]
["R003258501","甲斐　真号","3級","男性","S審判","大分県"]
["R000892818","甲斐　睦記","3級","男性","S審判","大分県"]
["R004794055","笠置　貴路","3級","男性","S審判","大分県"]
["R001262829","笠置　忠照","3級","男性","S審判","大分県"]
["R003255771","笠野　わかこ","3級","女性","S審判","大分県"]
["R004793542","梶川　和志","3級","男性","S審判","大分県"]
["R006574154","梶原　公","3級","男性","S審判","大分県"]
["R004055585","梶原　賢士","3級","男性","S審判","大分県"]
["R009198511","梶原　幸平","3級","男性","S審判","大分県"]
["R001262838","梶原　誠司","3級","男性","S審判","大分県"]
["R010099455","糟谷　浩志","3級","男性","S審判","大分県"]
["R004714642","加藤　敦士","3級","男性","S審判","大分県"]
["R007959608","加藤　恭介","3級","男性","S審判","大分県"]
["R009197929","加藤　泰広","3級","男性","S審判","大分県"]
["R010261482","金子　翔","3級","男性","S審判","大分県"]
["R001262883","神川　基","3級","男性","S審判","大分県"]
["R002996668","上西　亮次","3級","男性","S審判","大分県"]
["R001255616","川井　勇介","3級","男性","S審判","大分県"]
["R007959963","川内　智弘","3級","男性","S審判","大分県"]
["R006220952","川﨑　浩司","3級","男性","S審判","大分県"]
["R002917430","河津　裕徳","3級","男性","S審判","大分県"]
["R005103418","河野　貴裕","3級","男性","S審判","大分県"]
["R001255740","川野　剛","3級","男性","S審判","大分県"]
["R001255713","河野　英樹","3級","男性","S審判","大分県"]
["R001262935","河野　裕明","3級","男性","S審判","大分県"]
["R010281800","河野　光喜","3級","男性","S審判","大分県"]
["R006094001","河野　祐司","3級","男性","S審判","大分県"]
["R001255722","河野　隆次","3級","男性","S審判","大分県"]
["R010214623","川畑　拓人","3級","男性","S審判","大分県"]
["R010093459","川辺　祐介","3級","男性","S審判","大分県"]
["R003351145","川村　啓一郎","3級","男性","S審判","大分県"]
["R001255935","川村　正樹","3級","男性","S審判","大分県"]
["R004112020","川元　翔","3級","男性","S審判","大分県"]
["R003256053","菊地　謙一","3級","男性","S審判","大分県"]
["R007890271","菊地　玄","3級","男性","S審判","大分県"]
["R010255152","菊池　芳郎","3級","男性","S審判","大分県"]
["R007959583","吉川　一馬","3級","男性","S審判","大分県"]
["R010074021","木津　洋孝","3級","男性","S審判","大分県"]
["R010099444","木本　将一","3級","男性","S審判","大分県"]
["R007003468","木本　翔平","3級","男性","S審判","大分県"]
["R001256129","木本　信之","3級","男性","S審判","大分県"]
["R001256138","木本　将斗","3級","男性","S審判","大分県"]
["R001251504","清原　雄太","3級","男性","S審判","大分県"]
["R007003486","清松　隆浩","3級","男性","S審判","大分県"]
["R001263022","吉良　和明","3級","男性","S審判","大分県"]
["R001263031","吉良　信輝","3級","男性","S審判","大分県"]
["R001263040","吉良　光峰","3級","男性","S審判","大分県"]
["R001263068","切封　智和","3級","男性","S審判","大分県"]
["R001263077","草野　学","3級","男性","S審判","大分県"]
["R001263129","工藤　慎一","3級","男性","S審判","大分県"]
["R003258413","工藤　隆貴","3級","男性","S審判","大分県"]
["R001265312","工藤　高信","3級","男性","S審判","大分県"]
["R010189301","工藤　拓海","3級","男性","S審判","大分県"]
["R001263086","工藤　信弘","3級","男性","S審判","大分県"]
["R003351251","工藤　暢裕","3級","男性","S審判","大分県"]
["R007002982","工藤　政野","3級","男性","S審判","大分県"]
["R001263110","工藤　康博","3級","男性","S審判","大分県"]
["R008798262","工藤　龍成","3級","男性","S審判","大分県"]
["R003677131","久保　雅敬","3級","男性","S審判","大分県"]
["R001256305","久保田　英樹","3級","男性","S審判","大分県"]
["R010259420","窪田　雅一","3級","男性","S審判","大分県"]
["R001256314","久保山　守","3級","男性","S審判","大分県"]
["R010120185","熊谷　薫","3級","男性","S審判","大分県"]
["R001263165","熊谷　浩之","3級","男性","S審判","大分県"]
["R007334890","熊谷　勇哉","3級","男性","S審判","大分県"]
["R010193706","倉光　勇弥","3級","男性","S審判","大分県"]
["R010074028","栗井　勝","3級","男性","S審判","大分県"]
["R002037275","栗牧　翔一","3級","男性","S審判","大分県"]
["R008634496","桑嶋　利彦","3級","男性","S審判","大分県"]
["R001263183","桑原　栄二郎","3級","男性","S審判","大分県"]
["R008634487","桑原　将吾","3級","男性","S審判","大分県"]
["R001256402","小石川　悟","3級","男性","S審判","大分県"]
["R001263192","小出　和明","3級","男性","S審判","大分県"]
["R004794000","河野　永吉","3級","男性","S審判","大分県"]
["R007003228","河野　晋也","3級","男性","S審判","大分県"]
["R006220387","河野　翼","3級","男性","S審判","大分県"]
["R010016623","古賀　貴大","3級","男性","S審判","大分県"]
["R001263217","古賀　隆史","3級","男性","S審判","大分県"]
["R001263235","小嶋　亮","3級","男性","S審判","大分県"]
["R009546073","小玉　篤史","3級","男性","S審判","大分県"]
["R009198502","児玉　祥吾","3級","男性","S審判","大分県"]
["R005405255","小手川　朋輝","3級","男性","S審判","大分県"]
["R007728673","小林　亮介","3級","男性","S審判","大分県"]
["R005987209","小堀　良祐","3級","男性","S審判","大分県"]
["R001263314","近藤　健二","3級","男性","S審判","大分県"]
["R006591364","近藤　裕之","3級","男性","S審判","大分県"]
["R001263305","近藤　靖彦","3級","男性","S審判","大分県"]
["R009408852","後藤　憲治","3級","男性","S審判","大分県"]
["R004793667","後藤　悟","3級","男性","S審判","大分県"]
["R001263299","後藤　伸太郎","3級","男性","S審判","大分県"]
["R008798226","後藤　貴志","3級","男性","S審判","大分県"]
["R001251540","後藤　毅","3級","男性","S審判","大分県"]
["R001256624","後藤　文生","3級","男性","S審判","大分県"]
["R010067947","後藤　美宇","3級","女性","S審判","大分県"]
["R001263271","後藤　稔","3級","男性","S審判","大分県"]
["R007960215","後藤　裕也","3級","男性","S審判","大分県"]
["R005987005","後藤　好将","3級","男性","S審判","大分県"]
["R005619584","権藤　究","3級","男性","S審判","大分県"]
["R001263332","斎藤　克己","3級","男性","S審判","大分県"]
["R010240556","齋藤　秀彦","3級","男性","S審判","大分県"]
["R001263369","酒井　清行","3級","男性","S審判","大分県"]
["R003972416","酒井　啓太","3級","男性","S審判","大分県"]
["R001263350","酒井　祐三","3級","男性","S審判","大分県"]
["R004714688","坂本　克也","3級","男性","S審判","大分県"]
["R003350863","坂本　圭","3級","男性","S審判","大分県"]
["R009072268","坂本　載瑛","3級","女性","S審判","大分県"]
["R001263402","坂本　淳吾","3級","男性","S審判","大分県"]
["R006849191","坂本　大典","3級","男性","S審判","大分県"]
["R006574400","酒盛　政晴","3級","男性","S審判","大分県"]
["R006664864","相良　章成","3級","男性","S審判","大分県"]
["R002917500","迫　裕作","3級","男性","S審判","大分県"]
["R004282046","佐々木　栄一","3級","男性","S審判","大分県"]
["R010214635","佐々木　晃司","3級","男性","S審判","大分県"]
["R007335136","佐々木　秀樹","3級","男性","S審判","大分県"]
["R001263411","佐々木　正志","3級","男性","S審判","大分県"]
["R010264275","佐多　和紀","3級","男性","S審判","大分県"]
["R003677052","佐田　敬介","3級","男性","S審判","大分県"]
["R001263420","佐田　秀信","3級","男性","S審判","大分県"]
["R001263448","佐藤　昭生","3級","男性","S審判","大分県"]
["R001263484","佐藤　一好","3級","男性","S審判","大分県"]
["R005603981","佐藤　健","3級","男性","S審判","大分県"]
["R010261478","佐藤　賢太","3級","男性","S審判","大分県"]
["R009460551","佐藤　慎二","3級","男性","S審判","大分県"]
["R005164394","佐藤　嵩隼","3級","男性","S審判","大分県"]
["R008634706","佐藤　巨規","3級","男性","S審判","大分県"]
["R002384599","佐藤　洋","3級","男性","S審判","大分県"]
["R007728512","佐藤　誠","3級","男性","S審判","大分県"]
["R002530161","佐藤　光義","3級","男性","S審判","大分県"]
["R007959811","佐藤　康之","3級","男性","S審判","大分県"]
["R007003291","佐藤　優介","3級","男性","S審判","大分県"]
["R001263475","佐藤　隆太","3級","男性","S審判","大分県"]
["R009552560","佐藤　亮","3級","男性","S審判","大分県"]
["R001257252","三宮　仁","3級","男性","S審判","大分県"]
["R007959936","塩田　誠","3級","男性","S審判","大分県"]
["R010167723","敷島　孝太","3級","男性","S審判","大分県"]
["R009546781","四嶋　遼大","3級","男性","S審判","大分県"]
["R001257322","師藤　一也","3級","男性","S審判","大分県"]
["R001257340","篠田　公成","3級","男性","S審判","大分県"]
["R004326535","信田　卓也","3級","男性","S審判","大分県"]
["R010073990","篠田　裕也","3級","男性","S審判","大分県"]
["R010189333","芝崎　駿","3級","男性","S審判","大分県"]
["R008634715","柴田　健一","3級","男性","S審判","大分県"]
["R010214543","柴田　峻佑","3級","男性","S審判","大分県"]
["R002938017","柴田　徹","3級","男性","S審判","大分県"]
["R001263536","渋谷　崇","3級","男性","S審判","大分県"]
["R001263545","島　邦彦","3級","男性","S審判","大分県"]
["R003317114","島津　広光","3級","男性","S審判","大分県"]
["R007686216","清水　圭二","3級","男性","S審判","大分県"]
["R001558364","下野　智洋","3級","男性","S審判","大分県"]
["R006910259","下原　優一","3級","男性","S審判","大分県"]
["R006849182","志谷　進","3級","男性","S審判","大分県"]
["R001263590","首藤　圭介","3級","男性","S審判","大分県"]
["R001263581","首藤　賢一","3級","男性","S審判","大分県"]
["R001934616","首藤　貴弘","3級","男性","S審判","大分県"]
["R001263624","白石　正","3級","男性","S審判","大分県"]
["R009554780","白江　直樹","3級","男性","S審判","大分県"]
["R006849128","城全　晃孝","3級","男性","S審判","大分県"]
["R001263606","城全　孝成","3級","男性","S審判","大分県"]
["R001263651","秦　啓一郎","3級","男性","S審判","大分県"]
["R001257641","秦　達郎","3級","男性","S審判","大分県"]
["R001263633","秦　雅暢","3級","男性","S審判","大分県"]
["R001257650","新貝　学","3級","男性","S審判","大分県"]
["R004793834","末松　敬雅","3級","男性","S審判","大分県"]
["R006097345","末松　由貴","3級","男性","S審判","大分県"]
["R006664961","末吉　裕樹","3級","男性","S審判","大分県"]
["R008515571","菅川　智","3級","男性","S審判","大分県"]
["R007003024","杉崎　恭介","3級","男性","S審判","大分県"]
["R010074299","杉本　大実","3級","男性","S審判","大分県"]
["R002530860","鈴木　史朗","3級","男性","S審判","大分県"]
["R008798369","鈴木　優希","3級","男性","S審判","大分県"]
["R008798013","隅田　哲平","3級","男性","S審判","大分県"]
["R010027823","清家　大介","3級","男性","S審判","大分県"]
["R001263679","関　憲二","3級","男性","S審判","大分県"]
["R000896665","関　文雄","3級","男性","S審判","大分県"]
["R008798174","関屋　俊侑","3級","男性","S審判","大分県"]
["R001263688","瀬口　篤","3級","男性","S審判","大分県"]
["R007606238","相馬　大典","3級","男性","S審判","大分県"]
["R001263697","曽我　大一郎","3級","男性","S審判","大分県"]
["R001263721","園　貴司","3級","男性","S審判","大分県"]
["R005987032","園　秀利","3級","男性","S審判","大分県"]
["R008798305","染矢　恭明","3級","男性","S審判","大分県"]
["R001263749","高尾　次郎","3級","男性","S審判","大分県"]
["R006203593","高島　秀樹","3級","男性","S審判","大分県"]
["R001263767","高田　友裕","3級","男性","S審判","大分県"]
["R001258048","高橋　修一","3級","男性","S審判","大分県"]
["R001263794","高橋　豊信","3級","男性","S審判","大分県"]
["R001263819","高橋　雅浩","3級","男性","S審判","大分県"]
["R001263828","髙橋　享誠","3級","男性","S審判","大分県"]
["R001263785","高橋　芳洋","3級","男性","S審判","大分県"]
["R005987120","高橋　涼太","3級","男性","S審判","大分県"]
["R001263846","高畑　徳治郎","3級","男性","S審判","大分県"]
["R001263837","高畑　智秀","3級","男性","S審判","大分県"]
["R002996738","高原　英司","3級","男性","S審判","大分県"]
["R001258154","高山　義正","3級","男性","S審判","大分県"]
["R003258477","田上　和広","3級","男性","S審判","大分県"]
["R001262272","瀧山　理恵","3級","女性","S審判","大分県"]
["R001263882","竹内　進","3級","男性","S審判","大分県"]
["R005527317","竹尾　和哉","3級","男性","S審判","大分県"]
["R003972489","竹嶋　仁","3級","男性","S審判","大分県"]
["R006220484","武智　正敏","3級","男性","S審判","大分県"]
["R007754243","竹中　勇人","3級","男性","S審判","大分県"]
["R006030599","竹村　研一郎","3級","男性","S審判","大分県"]
["R007335075","田坂　将和","3級","男性","S審判","大分県"]
["R010120124","田尻　貴志","3級","男性","S審判","大分県"]
["R004060170","立花　陽一郎","3級","男性","S審判","大分県"]
["R008626770","立川　大記","3級","男性","S審判","大分県"]
["R009430578","立川　千紗","3級","女性","S審判","大分県"]
["R008627043","立川　充","3級","男性","S審判","大分県"]
["R004683874","田中　貴大","3級","男性","S審判","大分県"]
["R001258394","田邉　義晶","3級","男性","S審判","大分県"]
["R010214544","谷口　寛汰","3級","男性","S審判","大分県"]
["R005164677","田村　孝弘","3級","男性","S審判","大分県"]
["R010190756","垰　真樹","3級","男性","S審判","大分県"]
["R010190755","伊達　俊介","3級","男性","S審判","大分県"]
["R004793579","團塚　晋之祐","3級","男性","S審判","大分県"]
["R001263961","津崎　雅彦","3級","男性","S審判","大分県"]
["R005430057","辻　一陽","3級","男性","S審判","大分県"]
["R010281819","辻井　拓夢","3級","男性","S審判","大分県"]
["R001265419","津田　憲生","3級","男性","S審判","大分県"]
["R001263998","堤　祐慈","3級","男性","S審判","大分県"]
["R006312943","坪井　亮磨","3級","男性","S審判","大分県"]
["R002996677","坪根　晃","3級","男性","S審判","大分県"]
["R001264003","津守　一雄","3級","男性","S審判","大分県"]
["R001264012","津守　正博","3級","男性","S審判","大分県"]
["R009408782","手島　冠","3級","男性","S審判","大分県"]
["R001264058","寺岡　富夫","3級","男性","S審判","大分県"]
["R001264049","寺岡　義彦","3級","男性","S審判","大分県"]
["R010120117","寺次　良生","3級","男性","S審判","大分県"]
["R001264067","寺林　直人","3級","男性","S審判","大分県"]
["R004226749","寺本　義高","3級","男性","S審判","大分県"]
["R004111340","唐下　直之","3級","男性","S審判","大分県"]
["R009072277","唐下　眞沙妃","3級","女性","S審判","大分県"]
["R010167725","東藤　正幸","3級","男性","S審判","大分県"]
["R001264076","藤内　伸悟","3級","男性","S審判","大分県"]
["R001264085","塔元　繁喜","3級","男性","S審判","大分県"]
["R004385653","徳永　尚也","3級","男性","S審判","大分県"]
["R002848671","徳永　浩幸","3級","男性","S審判","大分県"]
["R010172853","徳永　凌","3級","男性","S審判","大分県"]
["R010189300","徳光　将太","3級","男性","S審判","大分県"]
["R001258701","都甲　昌亨","3級","男性","S審判","大分県"]
["R006220961","歳納　真人","3級","男性","S審判","大分県"]
["R003972230","戸田　清","3級","男性","S審判","大分県"]
["R001258738","戸髙　博秋","3級","男性","S審判","大分県"]
["R010074292","戸高　裕登","3級","男性","S審判","大分県"]
["R003317354","戸伏　重治","3級","男性","S審判","大分県"]
["R008797759","冨永　憲司","3級","男性","S審判","大分県"]
["R010038307","友田　寛太","3級","女性","S審判","大分県"]
["R002935472","友成　義朗","3級","男性","S審判","大分県"]
["R010214602","内藤　翔悟","3級","男性","S審判","大分県"]
["R010250271","中尾　亜夢","3級","男性","S審判","大分県"]
["R002917722","中尾　倫彰","3級","男性","S審判","大分県"]
["R002530046","中上　聡志","3級","男性","S審判","大分県"]
["R010248585","中坂　大","3級","男性","S審判","大分県"]
["R003317071","中島　圭太","3級","男性","S審判","大分県"]
["R008634681","中島　康平","3級","男性","S審判","大分県"]
["R010190757","中島　佑介","3級","男性","S審判","大分県"]
["R010007829","中島　亮太","3級","男性","S審判","大分県"]
["R002996686","中園　真栄","3級","男性","S審判","大分県"]
["R001258969","中田　邦明","3級","男性","S審判","大分県"]
["R001264164","仲野　昭博","3級","男性","S審判","大分県"]
["R005429893","中野　佐和三","3級","男性","S審判","大分県"]
["R003421310","中野　雄斗","3級","男性","S審判","大分県"]
["R001264182","中原　圭介","3級","男性","S審判","大分県"]
["R010099448","中原　丈聖","3級","男性","S審判","大分県"]
["R007729104","中間　悠介","3級","男性","S審判","大分県"]
["R010279448","中村　俊太","3級","男性","S審判","大分県"]
["R007959990","中村　髙峰","3級","男性","S審判","大分県"]
["R010073993","仲村　陽一郎","3級","男性","S審判","大分県"]
["R010189259","中山　修一","3級","男性","S審判","大分県"]
["R005987528","中山　昌樹","3級","男性","S審判","大分県"]
["R004111580","永井　勇司","3級","男性","S審判","大分県"]
["R001258871","長尾　信宏","3級","男性","S審判","大分県"]
["R001264128","長尾　寿郎","3級","男性","S審判","大分県"]
["R001265084","長岡　俊之","3級","男性","S審判","大分県"]
["R001264137","永木　桂","3級","男性","S審判","大分県"]
["R001258978","長田　義弘","3級","男性","S審判","大分県"]
["R008798129","長野　佳太","3級","男性","S審判","大分県"]
["R001259092","長野　省三","3級","男性","S審判","大分県"]
["R005164941","永松　真朗","3級","男性","S審判","大分県"]
["R006889108","永松　真樹","3級","女性","S審判","大分県"]
["R010073992","永松　賢俊","3級","男性","S審判","大分県"]
["R010093429","名嶋　翔平","3級","男性","S審判","大分県"]
["R005986954","成原　政治","3級","男性","S審判","大分県"]
["R002908335","南里　秀樹","3級","男性","S審判","大分県","福岡県"]
["R004055372","西岡　泰一","3級","男性","S審判","大分県"]
["R010027839","西川　侑希","3級","男性","S審判","大分県"]
["R001251975","西田　淳一","3級","男性","S審判","大分県"]
["R005987102","西村　和久","3級","男性","S審判","大分県"]
["R001264234","西村　誠","3級","男性","S審判","大分県"]
["R009670176","西村　竜司","3級","男性","S審判","大分県"]
["R006573997","新田　直哉","3級","男性","S審判","大分県"]
["R001259287","新田　祐一郎","3級","男性","S審判","大分県"]
["R001264252","二ノ谷　徹","3級","男性","S審判","大分県"]
["R001264289","野田　洋平","3級","男性","S審判","大分県"]
["R007757994","野村　康佳","3級","男性","S審判","大分県"]
["R009546055","吐合　直樹","3級","男性","S審判","大分県"]
["R010027819","狭間　照央","3級","男性","S審判","大分県"]
["R001252017","橋本　伸太郎","3級","男性","S審判","大分県"]
["R008797962","橋本　葉音","3級","女性","S審判","大分県"]
["R010080634","畑中　賢三","3級","男性","S審判","大分県"]
["R010214541","羽田野　順一","3級","女性","S審判","大分県"]
["R001264304","羽田野　亘","3級","男性","S審判","大分県"]
["R008450238","浜崎　憲","3級","男性","S審判","大分県"]
["R001259588","浜崎　陽介","3級","男性","S審判","大分県"]
["R006221094","浜町　拓也","3級","男性","S審判","大分県"]
["R002384225","濱本　真治","3級","男性","S審判","大分県"]
["R001259667","原　宏一","3級","男性","S審判","大分県"]
["R005603802","原　俊輔","3級","男性","S審判","大分県"]
["R010167733","原　大貴","3級","男性","S審判","大分県"]
["R001264340","原田　浩司","3級","男性","S審判","大分県"]
["R007003413","原田　雅也","3級","男性","S審判","大分県"]
["R007211182","原田　龍太郎","3級","男性","S審判","大分県"]
["R002384465","東　一騎","3級","男性","S審判","大分県"]
["R001264359","東　和弘","3級","男性","S審判","大分県"]
["R001265482","久野　慎吾","3級","男性","S審判","大分県"]
["R006147048","姫野　一陽","3級","男性","S審判","大分県"]
["R005528307","姫野　恵一","3級","男性","S審判","大分県"]
["R010027843","姫野　孝太","3級","男性","S審判","大分県"]
["R001251151","姫野　隆英","3級","男性","S審判","大分県"]
["R001259870","平岡　正広","3級","男性","S審判","大分県"]
["R007002724","平原　裕己","3級","男性","S審判","大分県"]
["R007003501","廣瀬　惣一朗","3級","男性","S審判","大分県"]
["R001264401","廣瀬　文明","3級","男性","S審判","大分県"]
["R004386120","廣瀬　賢明","3級","男性","S審判","大分県"]
["R001264410","廣田　寧孝","3級","男性","S審判","大分県"]
["R001260070","廣戸　誠一","3級","男性","S審判","大分県"]
["R010069903","深田　知秀","3級","男性","S審判","大分県"]
["R009197691","深堀　祥司","3級","男性","S審判","大分県"]
["R010027861","福井　康平","3級","男性","S審判","大分県"]
["R001260113","福川　寿一","3級","男性","S審判","大分県"]
["R010178915","福島　瑞季","3級","男性","S審判","大分県"]
["R001264447","福元　研治","3級","男性","S審判","大分県"]
["R008798183","藤田　和也","3級","男性","S審判","大分県"]
["R008798217","藤本　勝爾","3級","男性","S審判","大分県"]
["R007753819","藤本　洋","3級","男性","S審判","大分県"]
["R001264474","藤原　達郎","3級","男性","S審判","大分県"]
["R007335288","藤原　大輔","3級","男性","S審判","大分県"]
["R010027860","藤原　佑史朗","3級","男性","S審判","大分県"]
["R003421772","藤原　龍司","3級","男性","S審判","大分県"]
["R001264483","渕　辰雄","3級","男性","S審判","大分県"]
["R004060189","古川　高","3級","男性","S審判","大分県"]
["R001600205","古戸　雅崇","3級","男性","S審判","大分県"]
["R001264508","古畑　葵","3級","男性","S審判","大分県"]
["R001264492","古畑　翼","3級","男性","S審判","大分県"]
["R005336104","古元　準一郎","3級","男性","S審判","大分県"]
["R010214558","分藤　真央","3級","男性","S審判","大分県"]
["R005987050","星野　敦","3級","男性","S審判","大分県"]
["R003351288","保月　寿智","3級","男性","S審判","大分県"]
["R006112343","堀内　信敏","3級","男性","S審判","大分県"]
["R010074297","堀口　隆志","3級","男性","S審判","大分県"]
["R006574066","本田　和也","3級","男性","S審判","大分県"]
["R002530310","本多　裕介","3級","男性","S審判","大分県"]
["R010127606","本戸　峰","3級","男性","S審判","大分県"]
["R010264273","前田　賢四朗","3級","男性","S審判","大分県"]
["R007003422","前田　篤史","3級","男性","S審判","大分県"]
["R001260557","マガリェンス　リシャルドソン","3級","男性","S審判","大分県"]
["R001264544","牧　和志","3級","男性","S審判","大分県"]
["R007002733","柾木　洋平","3級","男性","S審判","大分県"]
["R009547115","桝永　龍己","3級","男性","S審判","大分県"]
["R003421736","松浦　将志","3級","男性","S審判","大分県"]
["R010093436","松尾　達也","3級","男性","S審判","大分県"]
["R005987555","松崎　智則","3級","男性","S審判","大分県"]
["R004793816","松下　明史","3級","男性","S審判","大分県"]
["R004055479","松下　昌史","3級","男性","S審判","大分県"]
["R007335303","松田　稜","3級","男性","S審判","大分県"]
["R005987564","松野　祐太","3級","男性","S審判","大分県"]
["R009408737","松原　亜衣","3級","女性","S審判","大分県"]
["R006220916","松原　慎也","3級","男性","S審判","大分県"]
["R001264562","松本　光将","3級","男性","S審判","大分県"]
["R004060259","松本　祐輔","3級","男性","S審判","大分県"]
["R007173606","松本　哲彦","3級","男性","S審判","大分県"]
["R008481113","松山　和寛","3級","男性","S審判","大分県"]
["R006011372","松山　大二郎","3級","男性","S審判","大分県"]
["R001264580","真鍋　裕一","3級","男性","S審判","大分県"]
["R010264267","馬原　直人","3級","男性","S審判","大分県"]
["R008515535","丸尾　諭志","3級","男性","S審判","大分県"]
["R005405699","箕迫　雄介","3級","男性","S審判","大分県"]
["R007003307","水口　裕太","3級","女性","S審判","大分県"]
["R008174046","溝辺　宏輝","3級","男性","S審判","大分県"]
["R002917263","溝邊　祐幸","3級","男性","S審判","大分県"]
["R001264605","御手洗　毅","3級","男性","S審判","大分県"]
["R001264614","御手洗　正敏","3級","女性","S審判","大分県"]
["R004793658","光根　明徳","3級","男性","S審判","大分県"]
["R001264669","美濃　誠","3級","男性","S審判","大分県"]
["R004793764","三原　隼人","3級","男性","S審判","大分県"]
["R004112057","都　学志","3級","男性","S審判","大分県"]
["R001264687","宮迫　利範","3級","男性","S審判","大分県"]
["R004385495","宮崎　隆史","3級","男性","S審判","大分県"]
["R010099454","宮田　繁輝","3級","男性","S審判","大分県"]
["R001264696","宮部　修次","3級","男性","S審判","大分県"]
["R001252196","三好　美輝","3級","男性","S審判","大分県"]
["R001264702","向　直樹","3級","男性","S審判","大分県"]
["R010001968","宗岡　弦徳","3級","男性","S審判","大分県"]
["R001264711","村上　一幸","3級","男性","S審判","大分県"]
["R001265118","村上　貴志","3級","男性","S審判","大分県"]
["R003350854","毛藤　勇三","3級","男性","S審判","大分県"]
["R001252220","毛利　明博","3級","男性","S審判","大分県"]
["R007705326","用松　修平","3級","男性","S審判","大分県"]
["R008173861","本末　総治朗","3級","男性","S審判","大分県"]
["R002530851","本杉　拓也","3級","男性","S審判","大分県"]
["R010264271","本村　大樹","3級","男性","S審判","大分県"]
["R010172863","本村　優太","3級","男性","S審判","大分県"]
["R010189258","森　健太","3級","男性","S審判","大分県"]
["R007002779","森下　洋一","3級","男性","S審判","大分県"]
["R008634636","森山　幸介","3級","男性","S審判","大分県"]
["R001261398","森山　信浩","3級","男性","S審判","大分県"]
["R008798457","薬師寺　翔","3級","男性","S審判","大分県"]
["R008798314","薬師寺　亮太","3級","男性","S審判","大分県"]
["R010190754","八坂　柊","3級","男性","S審判","大分県"]
["R001264766","矢﨑　年勝","3級","男性","S審判","大分県"]
["R001264775","屋敷　伴幸","3級","男性","S審判","大分県"]
["R001264784","安枝　良二","3級","男性","S審判","大分県"]
["R006093987","保田　薫","3級","男性","S審判","大分県"]
["R005527308","柳井　孝則","3級","男性","S審判","大分県"]
["R010093477","柳井　瑞樹","3級","男性","S審判","大分県"]
["R004793825","柳川　知也","3級","男性","S審判","大分県"]
["R001261477","柳本　剛","3級","男性","S審判","大分県"]
["R009197594","柳元　哲哉","3級","男性","S審判","大分県"]
["R003972443","矢野　三千生","3級","男性","S審判","大分県"]
["R008537139","矢羽田　崇","3級","男性","S審判","大分県"]
["R004747206","山　大祐","3級","男性","S審判","大分県"]
["R001965713","山崎　和也","3級","男性","S審判","大分県"]
["R010240533","山﨑　典保","3級","男性","S審判","大分県"]
["R006147145","山下　省二","3級","男性","S審判","大分県"]
["R001261617","山下　智徳","3級","男性","S審判","大分県"]
["R007753606","山下　直一","3級","男性","S審判","大分県"]
["R010189260","山下　泰明","3級","男性","S審判","大分県"]
["R008523376","山末　翔太","3級","男性","S審判","大分県"]
["R001261653","山田　真二","3級","男性","S審判","大分県"]
["R004112011","山田　裕一","3級","男性","S審判","大分県"]
["R001252293","山中　早一郎","3級","男性","S審判","大分県"]
["R001264809","山野内　哲朗","3級","男性","S審判","大分県"]
["R005164358","山宮　俊寛","3級","男性","S審判","大分県"]
["R005603486","山本　篤","3級","男性","S審判","大分県"]
["R010189296","山本　和真","3級","男性","S審判","大分県"]
["R001252336","山本　貴志","3級","男性","S審判","大分県"]
["R003351093","山本　哲司","3級","男性","S審判","大分県"]
["R004111562","山本　悠司","3級","男性","S審判","大分県"]
["R001264836","幸　靖博","3級","男性","S審判","大分県"]
["R001261778","湯田　浩士","3級","男性","S審判","大分県"]
["R008515553","柚木　徹也","3級","男性","S審判","大分県"]
["R003421374","横山　解史","3級","男性","S審判","大分県"]
["R001261802","吉賀　智彦","3級","男性","S審判","大分県"]
["R001264854","吉田　栄治","3級","男性","S審判","大分県"]
["R010120115","吉田　和雅","3級","男性","S審判","大分県"]
["R008377625","吉田　敬一","3級","男性","S審判","大分県"]
["R008173728","吉田　享宏","3級","男性","S審判","大分県"]
["R003972665","吉田　大助","3級","男性","S審判","大分県"]
["R007090686","吉元　健太朗","3級","男性","S審判","大分県"]
["R010240571","吉元　剛","3級","男性","S審判","大分県"]
["R001261954","四辻　隆道","3級","男性","S審判","大分県"]
["R003421541","四元　厚次","3級","男性","S審判","大分県"]
["R003351154","脇　東洋","3級","男性","S審判","大分県"]
["R001264872","脇　雄洋","3級","男性","S審判","大分県"]
["R006220378","和喜田　拓","3級","男性","S審判","大分県"]
["R004386218","和才　幸司","3級","男性","S審判","大分県"]
["R007757657","渡辺　敬亮","3級","男性","S審判","大分県"]
["R010007794","渡邉　卓人","3級","男性","S審判","大分県"]
["R001264915","渡辺　博文","3級","男性","S審判","大分県"]
["R001264906","渡辺　稔","3級","男性","S審判","大分県"]
["R001262111","渡辺　陽一郎","3級","男性","S審判","大分県"]
["R001252390","渡里　賢人","3級","男性","S審判","大分県"]
["R007729070","和田　健一郎","3級","男性","S審判","大分県"]
["R001264890","和田　健二","3級","男性","S審判","大分県"]
["R001869127","和田　浩","3級","男性","S審判","大分県"]

{"sheet":"選手名簿","index":18,"n_rows":342,"n_cols":10,"rows_kept":342,"cut":false,"hidden":true,"merged":[]}
[{"$f":"CONCATENATE(B1,\"_\",C1)","v":"大会参加チーム名_背番号"},"大会参加チーム名","背番号","ポジション","選手名漢字","選手名カナ","学年","男女区分","キャプテン","前登録チーム"]
["玖珠サッカースポーツ少年団_1","玖珠サッカースポーツ少年団",{"$f":"(\"1\")","v":"1"},"FW","穴本　洋平","アナモト　ヨウヘイ",5,"男子"]
["玖珠サッカースポーツ少年団_2","玖珠サッカースポーツ少年団",{"$f":"(\"2\")","v":"2"},"DF","井上　大騎","イノウエ　ダイキ",5,"男子"]
["玖珠サッカースポーツ少年団_3","玖珠サッカースポーツ少年団",{"$f":"(\"3\")","v":"3"},"DF","溝口　虎汰郎","ミゾグチ　コタロウ",5,"男子"]
["玖珠サッカースポーツ少年団_4","玖珠サッカースポーツ少年団",{"$f":"(\"4\")","v":"4"},"DF","井上　遊太","イノウエ　ユラタ",5,"男子"]
["玖珠サッカースポーツ少年団_5","玖珠サッカースポーツ少年団",{"$f":"(\"5\")","v":"5"},"GK","了戒　大雅","リョウカイ　タイガ",5,"男子"]
["玖珠サッカースポーツ少年団_6","玖珠サッカースポーツ少年団",{"$f":"(\"6\")","v":"6"},"MF","秋吉　祥吾","アキヨシ　ショウゴ",5,"男子"]
["玖珠サッカースポーツ少年団_7","玖珠サッカースポーツ少年団",{"$f":"(\"7\")","v":"7"},"MF","日隈　翔吾","ヒグマ　ショウゴ",5,"男子"]
["玖珠サッカースポーツ少年団_8","玖珠サッカースポーツ少年団",{"$f":"(\"8\")","v":"8"},"MF","石井　幸之助","イシイ　コウノスケ",5,"男子"]
["玖珠サッカースポーツ少年団_9","玖珠サッカースポーツ少年団",{"$f":"(\"9\")","v":"9"},"FW","中　海舟","ナカ　カイシュウ",5,"男子","○"]
["玖珠サッカースポーツ少年団_11","玖珠サッカースポーツ少年団",{"$f":"(\"11\")","v":"11"},"DF","小野　昴輝","オノ　コウキ",5,"男子"]
["ＦＣ　ＷＡＹＳ_2","ＦＣ　ＷＡＹＳ",{"$f":"(\"2\")","v":"2"},"MF","角野　泰偲","カクノ　タイシ",5,"男子"]
["ＦＣ　ＷＡＹＳ_3","ＦＣ　ＷＡＹＳ",{"$f":"(\"3\")","v":"3"},"MF","梶原　颯汰","カジワラ　ソウタ",5,"男子"]
["ＦＣ　ＷＡＹＳ_4","ＦＣ　ＷＡＹＳ",{"$f":"(\"4\")","v":"4"},"MF","金子　周太","カネコ　シュウタ",5,"男子"]
["ＦＣ　ＷＡＹＳ_5","ＦＣ　ＷＡＹＳ",{"$f":"(\"5\")","v":"5"},"DF","兒島　佑朔","コジマ　ユウサク",5,"男子"]
["ＦＣ　ＷＡＹＳ_6","ＦＣ　ＷＡＹＳ",{"$f":"(\"6\")","v":"6"},"MF","西願　玄騎","サイガン　ゲンキ",5,"男子"]
["ＦＣ　ＷＡＹＳ_7","ＦＣ　ＷＡＹＳ",{"$f":"(\"7\")","v":"7"},"MF","吉井　琉輝斗","ヨシイ　ルキト",5,"男子","○"]
["ＦＣ　ＷＡＹＳ_8","ＦＣ　ＷＡＹＳ",{"$f":"(\"8\")","v":"8"},"MF","金子　寛太","カネコ　カンタ",4,"男子"]
["ＦＣ　ＷＡＹＳ_9","ＦＣ　ＷＡＹＳ",{"$f":"(\"9\")","v":"9"},"DF","松崎　壮悟","マツザキ　ショウゴ",5,"男子"]
["ＦＣ　ＷＡＹＳ_10","ＦＣ　ＷＡＹＳ",{"$f":"(\"10\")","v":"10"},"FW","今仁　雅治","イマニ　マサハル",5,"男子"]
["ＦＣ　ＷＡＹＳ_11","ＦＣ　ＷＡＹＳ",{"$f":"(\"11\")","v":"11"},"MF","本多　勝","ホンダ　ショウ",4,"男子"]
["ＦＣ　ＷＡＹＳ_12","ＦＣ　ＷＡＹＳ",{"$f":"(\"12\")","v":"12"},"MF","永岡　大空","ナガオカ　ソラ",5,"男子"]
["ＦＣ　ＷＡＹＳ_13","ＦＣ　ＷＡＹＳ",{"$f":"(\"13\")","v":"13"},"FW","高橋　亜門","タカハシ　アモン",4,"男子"]
["ＦＣ　ＷＡＹＳ_14","ＦＣ　ＷＡＹＳ",{"$f":"(\"14\")","v":"14"},"MF","津々良　瑠輝","ツヅラ　リュウキ",4,"男子"]
["ＦＣ　ＷＡＹＳ_15","ＦＣ　ＷＡＹＳ",{"$f":"(\"15\")","v":"15"},"MF","三ヶ尻　栄斗","ミカジリ　エイト",4,"男子"]
["ＦＣ　ＷＡＹＳ_16","ＦＣ　ＷＡＹＳ",{"$f":"(\"16\")","v":"16"},"GK","三ヶ尻　蒼哉","ミカジリ　ソウヤ",5,"男子"]
["ＦＣ　ＷＡＹＳ_17","ＦＣ　ＷＡＹＳ",{"$f":"(\"17\")","v":"17"},"DF","林　泰毅","ハヤシ　タイキ",4,"男子"]
["八坂少年サッカークラブ_1","八坂少年サッカークラブ",{"$f":"(\"1\")","v":"1"},"GK","青野　良真","アオノ　リョウマ",5,"男子"]
["八坂少年サッカークラブ_2","八坂少年サッカークラブ",{"$f":"(\"2\")","v":"2"},"DF","梅田　昌志","ウメダ　マサシ",5,"男子"]
["八坂少年サッカークラブ_3","八坂少年サッカークラブ",{"$f":"(\"3\")","v":"3"},"DF","野﨑　麻琉","ノザキ　マル",4,"男子"]
["八坂少年サッカークラブ_4","八坂少年サッカークラブ",{"$f":"(\"4\")","v":"4"},"FW","工藤　愛叶","クドウ　マナト",4,"男子"]
["八坂少年サッカークラブ_6","八坂少年サッカークラブ",{"$f":"(\"6\")","v":"6"},"DF","中根　漸","ナカネ　ゼン",5,"男子"]
["八坂少年サッカークラブ_7","八坂少年サッカークラブ",{"$f":"(\"7\")","v":"7"},"MF","藤原　巧惺","フジワラ　コウセイ",5,"男子","○"]
["八坂少年サッカークラブ_8","八坂少年サッカークラブ",{"$f":"(\"8\")","v":"8"},"FW","渡邊　駿貴","ワタナベ　シュンキ",3,"男子"]
["八坂少年サッカークラブ_9","八坂少年サッカークラブ",{"$f":"(\"9\")","v":"9"},"MF","元木　漣","モトキ　レン",5,"男子"]
["八坂少年サッカークラブ_10","八坂少年サッカークラブ",{"$f":"(\"10\")","v":"10"},"MF","阿部　真佳","アベ　マナカ",4,"女子小学生"]
["八坂少年サッカークラブ_11","八坂少年サッカークラブ",{"$f":"(\"11\")","v":"11"},"FW","旭　怜仁","アサヒ　レント",5,"男子"]
["八坂少年サッカークラブ_12","八坂少年サッカークラブ",{"$f":"(\"12\")","v":"12"},"FW","西岡　雄飛","ニシオカ　ユウヒ",5,"男子"]
["八坂少年サッカークラブ_13","八坂少年サッカークラブ",{"$f":"(\"13\")","v":"13"},"MF","青野　鈴華","アオノ　リンカ",3,"女子小学生"]
["八坂少年サッカークラブ_14","八坂少年サッカークラブ",{"$f":"(\"14\")","v":"14"},"FW","工藤　唯菜","クドウ　ユイナ",3,"女子小学生"]
["八坂少年サッカークラブ_15","八坂少年サッカークラブ",{"$f":"(\"15\")","v":"15"},"FW","浅野　力我","アサノ　リキガ",3,"男子"]
["八坂少年サッカークラブ_17","八坂少年サッカークラブ",{"$f":"(\"17\")","v":"17"},"GK","大村　響葵","オオムラ　ヒビキ",4,"男子"]
["鶴居ＳＳＳ_1","鶴居ＳＳＳ",{"$f":"(\"1\")","v":"1"},"GK","眞鍋　慧士","マナベ　ケイシ",5,"男子"]
["鶴居ＳＳＳ_2","鶴居ＳＳＳ",{"$f":"(\"2\")","v":"2"},"DF","畑中　陽介","ハタナカ　ヨウスケ",5,"男子"]
["鶴居ＳＳＳ_3","鶴居ＳＳＳ",{"$f":"(\"3\")","v":"3"},"FW","大江　真佐仁","オオエ　マサヒト",5,"男子","○","三保サッカークラブ"]
["鶴居ＳＳＳ_4","鶴居ＳＳＳ",{"$f":"(\"4\")","v":"4"},"MF","井上　翔伍","イノウエ　ショウゴ",5,"男子"]
["鶴居ＳＳＳ_5","鶴居ＳＳＳ",{"$f":"(\"5\")","v":"5"},"MF","吉岡　颯太","ヨシオカ　ソウタ",5,"男子"]
["鶴居ＳＳＳ_6","鶴居ＳＳＳ",{"$f":"(\"6\")","v":"6"},"MF","園田　啓介","ソノダ　ケイスケ",5,"男子"]
["鶴居ＳＳＳ_7","鶴居ＳＳＳ",{"$f":"(\"7\")","v":"7"},"DF","村澤　羚","ムラサワ　レイ",5,"男子"]
["鶴居ＳＳＳ_8","鶴居ＳＳＳ",{"$f":"(\"8\")","v":"8"},"FW","遠入　幸真","エンニュウ　コウマ",5,"男子"]
["鶴居ＳＳＳ_9","鶴居ＳＳＳ",{"$f":"(\"9\")","v":"9"},"MF","村上　陽琉","ムラカミ　ヒヨリ",5,"男子"]
["鶴居ＳＳＳ_10","鶴居ＳＳＳ",{"$f":"(\"10\")","v":"10"},"DF","飯干　拓斗","イイボシ　タクト",4,"男子"]
["鶴居ＳＳＳ_11","鶴居ＳＳＳ",{"$f":"(\"11\")","v":"11"},"DF","穐吉　胤杜","アキヨシ　カツト",4,"男子",null,"和田・如水少年サッカークラブ"]
["鶴居ＳＳＳ_12","鶴居ＳＳＳ",{"$f":"(\"12\")","v":"12"},"GK","森岡　音詠","モリオカ　トウタ",5,"男子"]
["鶴居ＳＳＳ_13","鶴居ＳＳＳ",{"$f":"(\"13\")","v":"13"},"MF","中川　晴喜","ナカガワ　ハルキ",4,"男子"]
["鶴居ＳＳＳ_14","鶴居ＳＳＳ",{"$f":"(\"14\")","v":"14"},"DF","新家　大心","シンヤ　タイシン",4,"男子"]
["鶴居ＳＳＳ_15","鶴居ＳＳＳ",{"$f":"(\"15\")","v":"15"},"FW","永松　銀河","ナガマツ　ギンガ",3,"男子"]
["大平山アソシエーション式フットボールクラブ_1","大平山アソシエーション式フットボールクラブ",{"$f":"(\"1\")","v":"1"},"GK","馬場　悠士郎","ババ　ユウシロウ",5,"男子","○"]
["大平山アソシエーション式フットボールクラブ_2","大平山アソシエーション式フットボールクラブ",{"$f":"(\"2\")","v":"2"},"MF","柳井　秀斗","ヤナイ　ヒデト",5,"男子"]
["大平山アソシエーション式フットボールクラブ_3","大平山アソシエーション式フットボールクラブ",{"$f":"(\"3\")","v":"3"},"MF","大平　修斗","オオヒラ　シュウト",5,"男子"]
["大平山アソシエーション式フットボールクラブ_5","大平山アソシエーション式フットボールクラブ",{"$f":"(\"5\")","v":"5"},"MF","加来　真衣子","カク　マイコ",5,"女子小学生"]
["大平山アソシエーション式フットボールクラブ_6","大平山アソシエーション式フットボールクラブ",{"$f":"(\"6\")","v":"6"},"MF","森　瞬平","モリ　シュンペイ",5,"男子"]
["大平山アソシエーション式フットボールクラブ_7","大平山アソシエーション式フットボールクラブ",{"$f":"(\"7\")","v":"7"},"MF","川崎　璃央","カワサキ　リオ",5,"男子"]
["大平山アソシエーション式フットボールクラブ_9","大平山アソシエーション式フットボールクラブ",{"$f":"(\"9\")","v":"9"},"MF","出利葉　俊太朗","イデリハ　シュンタロウ",5,"男子"]
[{"$f":"CONCATENATE(B65,\"_\",C65)","v":"大平山アソシエーション式フットボールクラブ_11"},"大平山アソシエーション式フットボールクラブ",{"$f":"(\"11\")","v":"11"},"MF","原田　晃成","ハラダ　コウセイ",5,"男子"]
["大平山アソシエーション式フットボールクラブ_12","大平山アソシエーション式フットボールクラブ",{"$f":"(\"12\")","v":"12"},"MF","魚返　悠吾","オガエリ　ユウゴ",5,"男子"]
["大平山アソシエーション式フットボールクラブ_13","大平山アソシエーション式フットボールクラブ",{"$f":"(\"13\")","v":"13"},"MF","大平　瑛翔","オオヒラ　エイト",4,"男子"]
["大平山アソシエーション式フットボールクラブ_14","大平山アソシエーション式フットボールクラブ",{"$f":"(\"14\")","v":"14"},"MF","山田　洸惺","ヤマダ　コウセイ",4,"男子"]
["大平山アソシエーション式フットボールクラブ_15","大平山アソシエーション式フットボールクラブ",{"$f":"(\"15\")","v":"15"},"MF","山田　汰惺","ヤマダ　タイセイ",4,"男子"]
["大平山アソシエーション式フットボールクラブ_16","大平山アソシエーション式フットボールクラブ",{"$f":"(\"16\")","v":"16"},"MF","笹原　大夢","ササハラ　ヒロム",4,"男子"]
["大平山アソシエーション式フットボールクラブ_17","大平山アソシエーション式フットボールクラブ",{"$f":"(\"17\")","v":"17"},"MF","出利葉　瑛太","イデリハ　エイタ",3,"男子"]
["大平山アソシエーション式フットボールクラブ_18","大平山アソシエーション式フットボールクラブ",{"$f":"(\"18\")","v":"18"},"MF","宮本　武虎","ミヤモト　タケトラ",3,"男子"]
["大平山アソシエーション式フットボールクラブ_21","大平山アソシエーション式フットボールクラブ",{"$f":"(\"21\")","v":"21"},"MF","馬場　愛梨","ババ　アイリ",3,"女子小学生"]
["中津沖代ＪＳＣ_1","中津沖代ＪＳＣ",{"$f":"(\"1\")","v":"1"},"DF","大森　宗樹","オオモリ　ソウジュ",5,"男子"]
["中津沖代ＪＳＣ_2","中津沖代ＪＳＣ",{"$f":"(\"2\")","v":"2"},"DF","田中　琉輝","タナカ　リュウキ",5,"男子"]
["中津沖代ＪＳＣ_3","中津沖代ＪＳＣ",{"$f":"(\"3\")","v":"3"},"DF","古梶　颯大","コカジ　ソウタ",5,"男子"]
["中津沖代ＪＳＣ_4","中津沖代ＪＳＣ",{"$f":"(\"4\")","v":"4"},"DF","高木　悠成","タカキ　ユウセイ",5,"男子"]
["中津沖代ＪＳＣ_6","中津沖代ＪＳＣ",{"$f":"(\"6\")","v":"6"},"FW","大久保　律輝","オオクボ　リツキ",5,"男子"]
["中津沖代ＪＳＣ_12","中津沖代ＪＳＣ",{"$f":"(\"12\")","v":"12"},"MF","小野　悠真","オノ　ユウシン",5,"男子","○"]
["中津沖代ＪＳＣ_14","中津沖代ＪＳＣ",{"$f":"(\"14\")","v":"14"},"FW","佐々木　陽音","ササキ　ハルト",5,"男子"]
["中津沖代ＪＳＣ_15","中津沖代ＪＳＣ",{"$f":"(\"15\")","v":"15"},"DF","井上　大和","イノウエ　ヤマト",5,"男子"]
["中津沖代ＪＳＣ_16","中津沖代ＪＳＣ",{"$f":"(\"16\")","v":"16"},"MF","長岡　観太","ナガオカ　カンタ",5,"男子"]
["中津沖代ＪＳＣ_17","中津沖代ＪＳＣ",{"$f":"(\"17\")","v":"17"},"FW","久家　侑奈","クゲ　ユウナ",4,"女子小学生"]
["中津沖代ＪＳＣ_18","中津沖代ＪＳＣ",{"$f":"(\"18\")","v":"18"},"GK","外園　湊心","ホカゾノ　ソウタ",4,"男子"]
["中津沖代ＪＳＣ_19","中津沖代ＪＳＣ",{"$f":"(\"19\")","v":"19"},"FW","小野　煌人","オノ　コウト",4,"男子"]
["中津沖代ＪＳＣ_20","中津沖代ＪＳＣ",{"$f":"(\"20\")","v":"20"},"FW","太田　康介","オオタ　コウスケ",3,"男子"]
["中津沖代ＪＳＣ_22","中津沖代ＪＳＣ",{"$f":"(\"22\")","v":"22"},"FW","佐々木　碧音","ササキ　アオト",3,"男子"]
["中津沖代ＪＳＣ_24","中津沖代ＪＳＣ",{"$f":"(\"24\")","v":"24"},"MF","甲斐　琉聖","カイ　リュウセイ",4,"男子"]
["中津沖代ＪＳＣ_25","中津沖代ＪＳＣ",{"$f":"(\"25\")","v":"25"},"FW","井手　碧","イデ　アオイ",3,"男子"]
["佐伯リベロフットボールクラブ_1","佐伯リベロフットボールクラブ",{"$f":"(\"1\")","v":"1"},"GK","児玉　周哉","コダマ　シュウヤ",5,"男子"]
["佐伯リベロフットボールクラブ_2","佐伯リベロフットボールクラブ",{"$f":"(\"2\")","v":"2"},"DF","上村　叶多","カミムラ　カナタ",4,"男子"]
["佐伯リベロフットボールクラブ_3","佐伯リベロフットボールクラブ",{"$f":"(\"3\")","v":"3"},"MF","岩丸　陽斗","イワマル　ハルト",4,"男子"]
["佐伯リベロフットボールクラブ_4","佐伯リベロフットボールクラブ",{"$f":"(\"4\")","v":"4"},"FW","菊池　大翔","キクチ　ヒロト",4,"男子"]
["佐伯リベロフットボールクラブ_5","佐伯リベロフットボールクラブ",{"$f":"(\"5\")","v":"5"},"DF","上杉　康真","ウエスギ　コウマ",5,"男子","○"]
["佐伯リベロフットボールクラブ_6","佐伯リベロフットボールクラブ",{"$f":"(\"6\")","v":"6"},"FW","伊東　叶希","イトウ　カナキ",5,"男子"]
["佐伯リベロフットボールクラブ_7","佐伯リベロフットボールクラブ",{"$f":"(\"7\")","v":"7"},"FW","百田　翔貴","モモタ　トキ",3,"男子"]
["佐伯リベロフットボールクラブ_8","佐伯リベロフットボールクラブ",{"$f":"(\"8\")","v":"8"},"MF","山野　流星心","ヤマノ　スバル",5,"男子"]
["佐伯リベロフットボールクラブ_9","佐伯リベロフットボールクラブ",{"$f":"(\"9\")","v":"9"},"MF","山村　千代花","ヤマムラ　チヨカ",5,"女子小学生"]
["佐伯リベロフットボールクラブ_10","佐伯リベロフットボールクラブ",{"$f":"(\"10\")","v":"10"},"FW","肥川　藍之介","ヒカワ　アイノスケ",5,"男子"]
["佐伯リベロフットボールクラブ_11","佐伯リベロフットボールクラブ",{"$f":"(\"11\")","v":"11"},"MF","奈須野　友登","ナスノ　ユウト",5,"男子"]
["佐伯リベロフットボールクラブ_13","佐伯リベロフットボールクラブ",{"$f":"(\"13\")","v":"13"},"DF","岩丸　優真","イワマル　ユウマ",3,"男子"]
["佐伯リベロフットボールクラブ_14","佐伯リベロフットボールクラブ",{"$f":"(\"14\")","v":"14"},"DF","山村　心大","ヤマムラ　シンタ",3,"男子"]
["佐伯リベロフットボールクラブ_15","佐伯リベロフットボールクラブ",{"$f":"(\"15\")","v":"15"},"DF","藤本　翔士","フジモト　カイト",3,"男子"]
["大分トリニータＵ－１２_1","大分トリニータＵ－１２",{"$f":"(\"1\")","v":"1"},"GK","加藤　航","カトウ　ワタル",5,"男子"]
["大分トリニータＵ－１２_2","大分トリニータＵ－１２",{"$f":"(\"2\")","v":"2"},"MF","新名　巧旺","ニイナ　コオ",5,"男子"]
["大分トリニータＵ－１２_3","大分トリニータＵ－１２",{"$f":"(\"3\")","v":"3"},"MF","斉藤　晄吏","サイトウ　ヒカリ",5,"男子",null,"豊府サッカースポーツ少年団"]
["大分トリニータＵ－１２_4","大分トリニータＵ－１２",{"$f":"(\"4\")","v":"4"},"DF","有村　凌史郎","アリムラ　リョウシロウ",5,"男子"]
["大分トリニータＵ－１２_5","大分トリニータＵ－１２",{"$f":"(\"5\")","v":"5"},"MF","石本　星七","イシモト　セナ",5,"男子",null,"豊府サッカースポーツ少年団"]
["大分トリニータＵ－１２_6","大分トリニータＵ－１２",{"$f":"(\"6\")","v":"6"},"MF","河野　歩夢","カワノ　アユム",5,"男子",null,"リノスフットサルクラブ　Ｕ－１２"]
["大分トリニータＵ－１２_7","大分トリニータＵ－１２",{"$f":"(\"7\")","v":"7"},"MF","染矢　宏輝","ソメヤ　コウキ",5,"男子"]
["大分トリニータＵ－１２_8","大分トリニータＵ－１２",{"$f":"(\"8\")","v":"8"},"FW","後藤　慶","ゴトウ　ケイ",5,"男子"]
["大分トリニータＵ－１２_9","大分トリニータＵ－１２",{"$f":"(\"9\")","v":"9"},"FW","柴田　峻徳","シバタ　シュントク",5,"男子",null,"ヴェルスパ大分　Ｕ－１２"]
["大分トリニータＵ－１２_10","大分トリニータＵ－１２",{"$f":"(\"10\")","v":"10"},"FW","木許　央雅","キモト　オウガ",5,"男子",null,"津久見サッカースポーツ少年団"]
["大分トリニータＵ－１２_11","大分トリニータＵ－１２",{"$f":"(\"11\")","v":"11"},"FW","原田　高虎","ハラダ　タカトラ",5,"男子",null,"スマイス　セレソン　スポーツクラブ"]
["大分トリニータＵ－１２_12","大分トリニータＵ－１２",{"$f":"(\"12\")","v":"12"},"GK","桑原　颯太","クワバラ　ソウタ",5,"男子"]
["大分トリニータＵ－１２_13","大分トリニータＵ－１２",{"$f":"(\"13\")","v":"13"},"MF","柳田　大希","ヤナギダ　ダイキ",5,"男子"]
["大分トリニータＵ－１２_14","大分トリニータＵ－１２",{"$f":"(\"14\")","v":"14"},"MF","仲村　陽太","ナカムラ　ヒナタ",5,"男子","○","由布川サッカースポーツ少年団"]
["大分トリニータＵ－１２_15","大分トリニータＵ－１２",{"$f":"(\"15\")","v":"15"},"MF","大堀　翼颯","オオホリ　ツバサ",5,"男子",null,"市浜レッドソックス"]
["大分トリニータＵ－１２_17","大分トリニータＵ－１２",{"$f":"(\"17\")","v":"17"},"FW","中道　大聖","ナカミチ　タイセイ",4,"男子",null,"リノスフットサルクラブ　Ｕ－１２"]
["大道サッカースポーツ少年団_1","大道サッカースポーツ少年団",{"$f":"(\"1\")","v":"1"},"GK","足立　暖和","アダチ　ハルト",4,"男子"]
["大道サッカースポーツ少年団_2","大道サッカースポーツ少年団",{"$f":"(\"2\")","v":"2"},"DF","武藤　匠海","ムトウ　タクミ",5,"男子"]
["大道サッカースポーツ少年団_3","大道サッカースポーツ少年団",{"$f":"(\"3\")","v":"3"},"DF","河野　優人","カワノ　ユウト",5,"男子"]
["大道サッカースポーツ少年団_4","大道サッカースポーツ少年団",{"$f":"(\"4\")","v":"4"},"MF","森　弦世","モリ　ゲンセイ",5,"男子","○"]
["大道サッカースポーツ少年団_5","大道サッカースポーツ少年団",{"$f":"(\"5\")","v":"5"},"MF","山中　翔太郎","ヤマナカ　ショウタロウ",5,"男子"]
["大道サッカースポーツ少年団_6","大道サッカースポーツ少年団",{"$f":"(\"6\")","v":"6"},"FW","森永　悠太","モリナガ　ユウタ",5,"男子"]
["大道サッカースポーツ少年団_7","大道サッカースポーツ少年団",{"$f":"(\"7\")","v":"7"},"MF","木村　太陽","キムラ　タイヨウ",4,"男子"]
["大道サッカースポーツ少年団_8","大道サッカースポーツ少年団",{"$f":"(\"8\")","v":"8"},"FW","首藤　教輔","シュトウ　キョウスケ",4,"男子"]
["大道サッカースポーツ少年団_9","大道サッカースポーツ少年団",{"$f":"(\"9\")","v":"9"},"MF","田原　健史朗","タハラ　ケンシロウ",4,"男子"]
[{"$f":"CONCATENATE(B129,\"_\",C129)","v":"大道サッカースポーツ少年団_10"},"大道サッカースポーツ少年団",{"$f":"(\"10\")","v":"10"},"FW","麻生　なるみ","アソウ　ナルミ",4,"女子小学生"]
["大道サッカースポーツ少年団_11","大道サッカースポーツ少年団",{"$f":"(\"11\")","v":"11"},"MF","利光　航琉","トシミツ　ワタル",4,"男子"]
["大道サッカースポーツ少年団_12","大道サッカースポーツ少年団",{"$f":"(\"12\")","v":"12"},"GK","竹尾　理志","タケオ　サトシ",3,"男子"]
["大道サッカースポーツ少年団_13","大道サッカースポーツ少年団",{"$f":"(\"13\")","v":"13"},"MF","上森　海司","ウエモリ　カイジ",4,"男子"]
["大道サッカースポーツ少年団_14","大道サッカースポーツ少年団",{"$f":"(\"14\")","v":"14"},"MF","山口　倫","ヤマグチ　リン",3,"男子"]
["大道サッカースポーツ少年団_15","大道サッカースポーツ少年団",{"$f":"(\"15\")","v":"15"},"MF","今畠　かえで","イマハタ　カエデ",3,"女子小学生"]
["大道サッカースポーツ少年団_16","大道サッカースポーツ少年団",{"$f":"(\"16\")","v":"16"},"FW","岩田　夏槻","イワタ　ナツキ",3,"男子"]
["宗方サッカークラブ_1","宗方サッカークラブ",{"$f":"(\"1\")","v":"1"},"GK","久保　颯香","クボ　フウガ",5,"男子"]
["宗方サッカークラブ_2","宗方サッカークラブ",{"$f":"(\"2\")","v":"2"},"MF","岩田　匡弘","イワタ　マサヒロ",4,"男子"]
["宗方サッカークラブ_3","宗方サッカークラブ",{"$f":"(\"3\")","v":"3"},"MF","安東　恭佑","アンドウ　キョウスケ",5,"男子"]
["宗方サッカークラブ_4","宗方サッカークラブ",{"$f":"(\"4\")","v":"4"},"DF","有田　祥太朗","アリタ　ショウタロウ",5,"男子"]
["宗方サッカークラブ_5","宗方サッカークラブ",{"$f":"(\"5\")","v":"5"},"DF","山本　恵太郎","ヤマモト　ケイタロウ",5,"男子","○"]
["宗方サッカークラブ_6","宗方サッカークラブ",{"$f":"(\"6\")","v":"6"},"FW","安東　明慧","アンドウ　アサト",5,"男子"]
["宗方サッカークラブ_7","宗方サッカークラブ",{"$f":"(\"7\")","v":"7"},"MF","矢野　寛大","ヤノ　カンタ",5,"男子"]
["宗方サッカークラブ_8","宗方サッカークラブ",{"$f":"(\"8\")","v":"8"},"DF","木戸　航大","キド　コウダイ",5,"男子"]
["宗方サッカークラブ_9","宗方サッカークラブ",{"$f":"(\"9\")","v":"9"},"MF","山下　玲和","ヤマシタ　レイオ",5,"男子"]
["宗方サッカークラブ_10","宗方サッカークラブ",{"$f":"(\"10\")","v":"10"},"FW","早木　悠登","ハヤキ　ユウト",5,"男子"]
["宗方サッカークラブ_11","宗方サッカークラブ",{"$f":"(\"11\")","v":"11"},"MF","山崎　櫂","ヤマサキ　カイ",4,"男子"]
["宗方サッカークラブ_12","宗方サッカークラブ",{"$f":"(\"12\")","v":"12"},"DF","清水　颯太","シミズ　ソウタ",4,"男子"]
["宗方サッカークラブ_13","宗方サッカークラブ",{"$f":"(\"13\")","v":"13"},"DF","後藤　竜樹","ゴトウ　リュウキ",4,"男子"]
["宗方サッカークラブ_21","宗方サッカークラブ",{"$f":"(\"21\")","v":"21"},"GK","小原　世楠","オハラ　セナ",5,"男子"]
["竹田直入ＦＣ_4","竹田直入ＦＣ",{"$f":"(\"4\")","v":"4"},"MF","土居　市之介","ドイ　イチノスケ",5,"男子"]
["竹田直入ＦＣ_8","竹田直入ＦＣ",{"$f":"(\"8\")","v":"8"},"MF","金田　煌矢","カネダ　コウシ",5,"男子","○"]
["竹田直入ＦＣ_9","竹田直入ＦＣ",{"$f":"(\"9\")","v":"9"},"DF","工藤　大明","クドウ　ダイメイ",5,"男子"]
["竹田直入ＦＣ_11","竹田直入ＦＣ",{"$f":"(\"11\")","v":"11"},"MF","倉本　康汰","クラモト　コウタ",5,"男子"]
["竹田直入ＦＣ_12","竹田直入ＦＣ",{"$f":"(\"12\")","v":"12"},"GK","内川　晴登","ウチカワ　ハルト",4,"男子"]
["竹田直入ＦＣ_13","竹田直入ＦＣ",{"$f":"(\"13\")","v":"13"},"FW","吉田　湊","ヨシダ　ミナト",4,"男子"]
["竹田直入ＦＣ_15","竹田直入ＦＣ",{"$f":"(\"15\")","v":"15"},"DF","土居　駿斗","ドイ　シュント",4,"男子"]
["竹田直入ＦＣ_16","竹田直入ＦＣ",{"$f":"(\"16\")","v":"16"},"FW","工藤　駿汰","クドウ　シュンタ",4,"男子"]
["竹田直入ＦＣ_17","竹田直入ＦＣ",{"$f":"(\"17\")","v":"17"},"FW","田北　昇大","タキタ　ショウダイ",4,"男子"]
["竹田直入ＦＣ_18","竹田直入ＦＣ",{"$f":"(\"18\")","v":"18"},"FW","山中　栄樟","ヤマナカ　エイショウ",4,"男子"]
["竹田直入ＦＣ_19","竹田直入ＦＣ",{"$f":"(\"19\")","v":"19"},"FW","吉良　心","キラ　ココロ",4,"男子"]
["ドリームキッズサッカークラブ_1","ドリームキッズサッカークラブ",{"$f":"(\"1\")","v":"1"},"GK","岩本　凌真","イワモト　リョウマ",4,"男子"]
["ドリームキッズサッカークラブ_2","ドリームキッズサッカークラブ",{"$f":"(\"2\")","v":"2"},"DF","阿部　夏樹","アベ　ナツキ",4,"男子"]
["ドリームキッズサッカークラブ_3","ドリームキッズサッカークラブ",{"$f":"(\"3\")","v":"3"},"MF","佐藤　嘉人","サトウ　ヒロト",3,"男子"]
["ドリームキッズサッカークラブ_4","ドリームキッズサッカークラブ",{"$f":"(\"4\")","v":"4"},"DF","鱒村　侑士","マスムラ　ユウト",4,"男子"]
["ドリームキッズサッカークラブ_5","ドリームキッズサッカークラブ",{"$f":"(\"5\")","v":"5"},"DF","長田　昂大","ナガタ　コウダイ",5,"男子"]
["ドリームキッズサッカークラブ_6","ドリームキッズサッカークラブ",{"$f":"(\"6\")","v":"6"},"DF","森崎　和翼","モリサキ　ナツ",5,"男子"]
["ドリームキッズサッカークラブ_7","ドリームキッズサッカークラブ",{"$f":"(\"7\")","v":"7"},"MF","吉村　心冴","ヨシムラ　シンゴ",5,"男子"]
["ドリームキッズサッカークラブ_8","ドリームキッズサッカークラブ",{"$f":"(\"8\")","v":"8"},"MF","須川　愛琉","スガワ　アイル",5,"男子"]
["ドリームキッズサッカークラブ_9","ドリームキッズサッカークラブ",{"$f":"(\"9\")","v":"9"},"MF","佐藤　彰人","サトウ　アキト",5,"男子","○"]
["ドリームキッズサッカークラブ_10","ドリームキッズサッカークラブ",{"$f":"(\"10\")","v":"10"},"FW","吉川　雅彦","ヨシカワ　マサヒコ",5,"男子"]
["ドリームキッズサッカークラブ_11","ドリームキッズサッカークラブ",{"$f":"(\"11\")","v":"11"},"FW","河野　真剣","カワノ　シンケン",4,"男子"]
["ドリームキッズサッカークラブ_12","ドリームキッズサッカークラブ",{"$f":"(\"12\")","v":"12"},"DF","大谷　悟史","オオタニ　サトシ",4,"男子"]
["ドリームキッズサッカークラブ_13","ドリームキッズサッカークラブ",{"$f":"(\"13\")","v":"13"},"FW","山下　紫凰","ヤマシタ　シオウ",4,"男子"]
["ドリームキッズサッカークラブ_14","ドリームキッズサッカークラブ",{"$f":"(\"14\")","v":"14"},"DF","子守　悠真","コモリ　ユウマ",4,"男子"]
["ドリームキッズサッカークラブ_15","ドリームキッズサッカークラブ",{"$f":"(\"15\")","v":"15"},"DF","伊東　海星","イトウ　カイセイ",4,"男子",null,"大在サッカースポーツ少年団"]
["ドリームキッズサッカークラブ_16","ドリームキッズサッカークラブ",{"$f":"(\"16\")","v":"16"},"GK","河野　優利","カワノ　ユウリ",5,"男子"]
["臼杵ＳＳＳ_1","臼杵ＳＳＳ",{"$f":"(\"1\")","v":"1"},"DF","谷口　洸斗","タニグチ　コウト",4,"男子","○"]
["臼杵ＳＳＳ_3","臼杵ＳＳＳ",{"$f":"(\"3\")","v":"3"},"DF","阿南　統胡","アナン　トウゴ",4,"男子"]
["臼杵ＳＳＳ_4","臼杵ＳＳＳ",{"$f":"(\"4\")","v":"4"},"MF","衛藤　瑞輝","エトウ　ミズキ",3,"男子"]
["臼杵ＳＳＳ_5","臼杵ＳＳＳ",{"$f":"(\"5\")","v":"5"},"GK","桑原　颯志","クワバラ　ソウシ",4,"男子"]
["臼杵ＳＳＳ_6","臼杵ＳＳＳ",{"$f":"(\"6\")","v":"6"},"MF","佐藤　優空","サトウ　ユウ",4,"男子"]
["臼杵ＳＳＳ_7","臼杵ＳＳＳ",{"$f":"(\"7\")","v":"7"},"MF","上田　蒼大","ウエダ　ソウタ",4,"男子"]
["臼杵ＳＳＳ_8","臼杵ＳＳＳ",{"$f":"(\"8\")","v":"8"},"MF","衛藤　遥也","エトウ　ハルヤ",4,"男子"]
["臼杵ＳＳＳ_9","臼杵ＳＳＳ",{"$f":"(\"9\")","v":"9"},"FW","伊藤　和航","イトウ　ワタル",4,"男子"]
["臼杵ＳＳＳ_10","臼杵ＳＳＳ",{"$f":"(\"10\")","v":"10"},"MF","安藤　律來","アンドウ　リク",4,"男子"]
["臼杵ＳＳＳ_11","臼杵ＳＳＳ",{"$f":"(\"11\")","v":"11"},"MF","足立　美菜","アダチ　ミナ",3,"女子小学生"]
["臼杵ＳＳＳ_12","臼杵ＳＳＳ",{"$f":"(\"12\")","v":"12"},"FW","川邊　希龍","カワベ　キリュウ",3,"男子"]
["臼杵ＳＳＳ_13","臼杵ＳＳＳ",{"$f":"(\"13\")","v":"13"},"DF","野口　真央","ノグチ　マオ",3,"男子"]
["ＦＣ安岐_1","ＦＣ安岐",{"$f":"(\"1\")","v":"1"},"GK","矢野　道之","ヤノ　ミチユキ",4,"男子"]
["ＦＣ安岐_2","ＦＣ安岐",{"$f":"(\"2\")","v":"2"},"FW","橋本　尚","ハシモト　ナオ",3,"男子"]
["ＦＣ安岐_3","ＦＣ安岐",{"$f":"(\"3\")","v":"3"},"MF","小俣　慶一郎","オマタ　ケイイチロウ",4,"男子"]
["ＦＣ安岐_4","ＦＣ安岐",{"$f":"(\"4\")","v":"4"},"DF","上野　海翔","ウエノ　カイト",4,"男子"]
[{"$f":"CONCATENATE(B193,\"_\",C193)","v":"ＦＣ安岐_5"},"ＦＣ安岐",{"$f":"(\"5\")","v":"5"},"DF","小田　冬絆","オダ　トウキ",4,"男子"]
["ＦＣ安岐_6","ＦＣ安岐",{"$f":"(\"6\")","v":"6"},"DF","橋本　昂太","ハシモト　コウタ",5,"男子"]
["ＦＣ安岐_7","ＦＣ安岐",{"$f":"(\"7\")","v":"7"},"DF","木村　翔瑛","キムラ　ヒエイ",5,"男子","○"]
["ＦＣ安岐_8","ＦＣ安岐",{"$f":"(\"8\")","v":"8"},"DF","小田原　奎斗","オダワラ　ケイト",5,"男子"]
["ＦＣ安岐_9","ＦＣ安岐",{"$f":"(\"9\")","v":"9"},"MF","清末　勘之","キヨスエ　ノリユキ",5,"男子"]
["ＦＣ安岐_10","ＦＣ安岐",{"$f":"(\"10\")","v":"10"},"MF","金江　徹平","カナエ　テッペイ",5,"男子"]
["ＦＣ安岐_11","ＦＣ安岐",{"$f":"(\"11\")","v":"11"},"FW","南　煌大","ミナミ　コウダイ",5,"男子"]
["ＦＣ安岐_16","ＦＣ安岐",{"$f":"(\"16\")","v":"16"},"FP","今富　蓮","イマトミ　レン",4,"男子"]
["スマイス・セレソン_1","スマイス・セレソン",{"$f":"(\"1\")","v":"1"},"GK","阿部　巧翔","アベ　タクト",5,"男子",null,"杵築東ＦＣ"]
["スマイス・セレソン_2","スマイス・セレソン",{"$f":"(\"2\")","v":"2"},"DF","渡辺　陽星","ワタナベ　ハル",5,"男子",null,"八坂少年サッカークラブ"]
["スマイス・セレソン_3","スマイス・セレソン",{"$f":"(\"3\")","v":"3"},"DF","土井　純音","ドイ　アツキ",5,"男子"]
["スマイス・セレソン_4","スマイス・セレソン",{"$f":"(\"4\")","v":"4"},"DF","原田　煌也","ハラダ　オウヤ",4,"男子"]
["スマイス・セレソン_5","スマイス・セレソン",{"$f":"(\"5\")","v":"5"},"DF","石川　巧翔","イシカワ　タクト",5,"男子"]
["スマイス・セレソン_6","スマイス・セレソン",{"$f":"(\"6\")","v":"6"},"FW","財前　大翔","ザイゼン　ヒロト",5,"男子",null,"スマイス日出"]
["スマイス・セレソン_7","スマイス・セレソン",{"$f":"(\"7\")","v":"7"},"MF","小野　陽士","オノ　アキト",5,"男子"]
["スマイス・セレソン_8","スマイス・セレソン",{"$f":"(\"8\")","v":"8"},"FW","佐々木　大和","ササキ　ヤマト",4,"男子"]
["スマイス・セレソン_9","スマイス・セレソン",{"$f":"(\"9\")","v":"9"},"MF","横田　啓","ヨコタ　ケイ",4,"男子"]
["スマイス・セレソン_10","スマイス・セレソン",{"$f":"(\"10\")","v":"10"},"FW","大室　響","オオムロ　ヒビキ",5,"男子","○","佐伯リベロフットボールクラブ"]
["スマイス・セレソン_11","スマイス・セレソン",{"$f":"(\"11\")","v":"11"},"MF","膳瀬　晃希","ゼンセ　コウキ",5,"男子"]
["スマイス・セレソン_12","スマイス・セレソン",{"$f":"(\"12\")","v":"12"},"DF","伊藤　迅世","イトウ　ハヤセ",5,"男子"]
["スマイス・セレソン_13","スマイス・セレソン",{"$f":"(\"13\")","v":"13"},"MF","堤　一惺","ツツミ　イッセイ",5,"男子",null,"春日ＳＳＳ"]
["スマイス・セレソン_14","スマイス・セレソン",{"$f":"(\"14\")","v":"14"},"MF","岩崎　蓮武","イワサキ　レン",4,"男子"]
["スマイス・セレソン_15","スマイス・セレソン",{"$f":"(\"15\")","v":"15"},"FW","安部　颯","アンベ　ハヤテ",4,"男子"]
["スマイス・セレソン_16","スマイス・セレソン",{"$f":"(\"16\")","v":"16"},"GK","赤野　陽亮","アカノ　ヨウスケ",5,"男子",null,"スマイス日出"]
["由布川サッカースポーツ少年団_1","由布川サッカースポーツ少年団",{"$f":"(\"1\")","v":"1"},"GK","後藤　颯太","ゴトウ　ソウタ",5,"男子"]
["由布川サッカースポーツ少年団_2","由布川サッカースポーツ少年団",{"$f":"(\"2\")","v":"2"},"FW","平川　颯人","ヒラカワ　ハヤト",3,"男子"]
["由布川サッカースポーツ少年団_3","由布川サッカースポーツ少年団",{"$f":"(\"3\")","v":"3"},"FW","小野　友真","オノ　ユウマ",4,"男子"]
["由布川サッカースポーツ少年団_4","由布川サッカースポーツ少年団",{"$f":"(\"4\")","v":"4"},"DF","上野　悠陽","ウエノ　ユウヒ",5,"男子"]
["由布川サッカースポーツ少年団_5","由布川サッカースポーツ少年団",{"$f":"(\"5\")","v":"5"},"MF","衛藤　庵","エトウ　イオリ",4,"男子"]
["由布川サッカースポーツ少年団_6","由布川サッカースポーツ少年団",{"$f":"(\"6\")","v":"6"},"MF","山口　優希翔","ヤマグチ　ユキト",4,"男子"]
["由布川サッカースポーツ少年団_7","由布川サッカースポーツ少年団",{"$f":"(\"7\")","v":"7"},"MF","甲斐　琉聖","カイ　リュウセイ",5,"男子"]
["由布川サッカースポーツ少年団_8","由布川サッカースポーツ少年団",{"$f":"(\"8\")","v":"8"},"DF","吉廣　幸太郎","ヨシヒロ　コウタロウ",5,"男子","○"]
["由布川サッカースポーツ少年団_9","由布川サッカースポーツ少年団",{"$f":"(\"9\")","v":"9"},"MF","江藤　翼","エトウ　ツバサ",5,"男子"]
["由布川サッカースポーツ少年団_10","由布川サッカースポーツ少年団",{"$f":"(\"10\")","v":"10"},"FW","陣内　奏心","ジンノウチ　カナト",5,"男子"]
["由布川サッカースポーツ少年団_11","由布川サッカースポーツ少年団",{"$f":"(\"11\")","v":"11"},"MF","佐藤　亮仁","サトウ　リョウト",5,"男子"]
["由布川サッカースポーツ少年団_12","由布川サッカースポーツ少年団",{"$f":"(\"12\")","v":"12"},"FW","大石　楓太","オオイシ　フウタ",2,"男子"]
["ＫＩＮＧＳ　ＦＯＯＴＢＡＬＬＣＬＵＢ　Ｕ－１２_1","ＫＩＮＧＳ　ＦＯＯＴＢＡＬＬＣＬＵＢ　Ｕ－１２",{"$f":"(\"1\")","v":"1"},"GK","宇佐川　蓮太郎","ウサガワ　レンタロウ",5,"男子"]
["ＫＩＮＧＳ　ＦＯＯＴＢＡＬＬＣＬＵＢ　Ｕ－１２_2","ＫＩＮＧＳ　ＦＯＯＴＢＡＬＬＣＬＵＢ　Ｕ－１２",{"$f":"(\"2\")","v":"2"},"DF","藤戸　瑛太","フジト　エイタ",4,"男子"]
["ＫＩＮＧＳ　ＦＯＯＴＢＡＬＬＣＬＵＢ　Ｕ－１２_3","ＫＩＮＧＳ　ＦＯＯＴＢＡＬＬＣＬＵＢ　Ｕ－１２",{"$f":"(\"3\")","v":"3"},"DF","後藤　武輝","ゴトウ　タケル",4,"男子"]
["ＫＩＮＧＳ　ＦＯＯＴＢＡＬＬＣＬＵＢ　Ｕ－１２_4","ＫＩＮＧＳ　ＦＯＯＴＢＡＬＬＣＬＵＢ　Ｕ－１２",{"$f":"(\"4\")","v":"4"},"FW","城　大雅","ジョウ　ハルマサ",3,"男子"]
["ＫＩＮＧＳ　ＦＯＯＴＢＡＬＬＣＬＵＢ　Ｕ－１２_5","ＫＩＮＧＳ　ＦＯＯＴＢＡＬＬＣＬＵＢ　Ｕ－１２",{"$f":"(\"5\")","v":"5"},"DF","山内　太夢","ヤマウチ　タイム",5,"男子"]
["ＫＩＮＧＳ　ＦＯＯＴＢＡＬＬＣＬＵＢ　Ｕ－１２_6","ＫＩＮＧＳ　ＦＯＯＴＢＡＬＬＣＬＵＢ　Ｕ－１２",{"$f":"(\"6\")","v":"6"},"MF","岡本　有人","オカモト　ユウト",5,"男子"]
["ＫＩＮＧＳ　ＦＯＯＴＢＡＬＬＣＬＵＢ　Ｕ－１２_7","ＫＩＮＧＳ　ＦＯＯＴＢＡＬＬＣＬＵＢ　Ｕ－１２",{"$f":"(\"7\")","v":"7"},"DF","竹尾　日輝","タケオ　ニチカ",5,"男子"]
["ＫＩＮＧＳ　ＦＯＯＴＢＡＬＬＣＬＵＢ　Ｕ－１２_8","ＫＩＮＧＳ　ＦＯＯＴＢＡＬＬＣＬＵＢ　Ｕ－１２",{"$f":"(\"8\")","v":"8"},"MF","高橋　翔空","タカハシ　トア",5,"男子"]
["ＫＩＮＧＳ　ＦＯＯＴＢＡＬＬＣＬＵＢ　Ｕ－１２_9","ＫＩＮＧＳ　ＦＯＯＴＢＡＬＬＣＬＵＢ　Ｕ－１２",{"$f":"(\"9\")","v":"9"},"FW","児玉　敦","コダマ　アツシ",5,"男子"]
["ＫＩＮＧＳ　ＦＯＯＴＢＡＬＬＣＬＵＢ　Ｕ－１２_10","ＫＩＮＧＳ　ＦＯＯＴＢＡＬＬＣＬＵＢ　Ｕ－１２",{"$f":"(\"10\")","v":"10"},"MF","篠田　怜央","シノダ　レオ",5,"男子","○"]
["ＫＩＮＧＳ　ＦＯＯＴＢＡＬＬＣＬＵＢ　Ｕ－１２_11","ＫＩＮＧＳ　ＦＯＯＴＢＡＬＬＣＬＵＢ　Ｕ－１２",{"$f":"(\"11\")","v":"11"},"MF","姫野　陽斗","ヒメノ　ハルト",5,"男子"]
["ＫＩＮＧＳ　ＦＯＯＴＢＡＬＬＣＬＵＢ　Ｕ－１２_12","ＫＩＮＧＳ　ＦＯＯＴＢＡＬＬＣＬＵＢ　Ｕ－１２",{"$f":"(\"12\")","v":"12"},"DF","友永　蒼士","トモナガ　ソウシ",5,"男子"]
["ＫＩＮＧＳ　ＦＯＯＴＢＡＬＬＣＬＵＢ　Ｕ－１２_13","ＫＩＮＧＳ　ＦＯＯＴＢＡＬＬＣＬＵＢ　Ｕ－１２",{"$f":"(\"13\")","v":"13"},"DF","安東　聖輝","アンドウ　イブキ",4,"男子"]
["ＫＩＮＧＳ　ＦＯＯＴＢＡＬＬＣＬＵＢ　Ｕ－１２_14","ＫＩＮＧＳ　ＦＯＯＴＢＡＬＬＣＬＵＢ　Ｕ－１２",{"$f":"(\"14\")","v":"14"},"MF","甲斐　勇聖","カイ　ユウセイ",4,"男子"]
["ＫＩＮＧＳ　ＦＯＯＴＢＡＬＬＣＬＵＢ　Ｕ－１２　Ｂ_1","ＫＩＮＧＳ　ＦＯＯＴＢＡＬＬＣＬＵＢ　Ｕ－１２　Ｂ",{"$f":"(\"1\")","v":"1"},"GK","小野　拓海","オノ　タクミ",4,"男子"]
["ＫＩＮＧＳ　ＦＯＯＴＢＡＬＬＣＬＵＢ　Ｕ－１２　Ｂ_2","ＫＩＮＧＳ　ＦＯＯＴＢＡＬＬＣＬＵＢ　Ｕ－１２　Ｂ",{"$f":"(\"2\")","v":"2"},"DF","安藤　透羽","アンドウ　トワ",5,"男子"]
["ＫＩＮＧＳ　ＦＯＯＴＢＡＬＬＣＬＵＢ　Ｕ－１２　Ｂ_3","ＫＩＮＧＳ　ＦＯＯＴＢＡＬＬＣＬＵＢ　Ｕ－１２　Ｂ",{"$f":"(\"3\")","v":"3"},"DF","新名　桜晟","ニイナ　オウセイ",5,"男子"]
["ＫＩＮＧＳ　ＦＯＯＴＢＡＬＬＣＬＵＢ　Ｕ－１２　Ｂ_4","ＫＩＮＧＳ　ＦＯＯＴＢＡＬＬＣＬＵＢ　Ｕ－１２　Ｂ",{"$f":"(\"4\")","v":"4"},"MF","平川　幹大","ヒラカワ　カンタ",4,"男子"]
["ＫＩＮＧＳ　ＦＯＯＴＢＡＬＬＣＬＵＢ　Ｕ－１２　Ｂ_5","ＫＩＮＧＳ　ＦＯＯＴＢＡＬＬＣＬＵＢ　Ｕ－１２　Ｂ",{"$f":"(\"5\")","v":"5"},"DF","芋岡　翼","イモオカ　ツバサ",4,"男子"]
["ＫＩＮＧＳ　ＦＯＯＴＢＡＬＬＣＬＵＢ　Ｕ－１２　Ｂ_6","ＫＩＮＧＳ　ＦＯＯＴＢＡＬＬＣＬＵＢ　Ｕ－１２　Ｂ",{"$f":"(\"6\")","v":"6"},"DF","猪股　太義","イノマタ　タイシ",5,"男子"]
["ＫＩＮＧＳ　ＦＯＯＴＢＡＬＬＣＬＵＢ　Ｕ－１２　Ｂ_7","ＫＩＮＧＳ　ＦＯＯＴＢＡＬＬＣＬＵＢ　Ｕ－１２　Ｂ",{"$f":"(\"7\")","v":"7"},"FW","佐藤　凛乃丞","サトウ　リンノスケ",4,"男子"]
["ＫＩＮＧＳ　ＦＯＯＴＢＡＬＬＣＬＵＢ　Ｕ－１２　Ｂ_8","ＫＩＮＧＳ　ＦＯＯＴＢＡＬＬＣＬＵＢ　Ｕ－１２　Ｂ",{"$f":"(\"8\")","v":"8"},"MF","若杉　駿輝","ワカスギ　トシキ",5,"男子"]
["ＫＩＮＧＳ　ＦＯＯＴＢＡＬＬＣＬＵＢ　Ｕ－１２　Ｂ_9","ＫＩＮＧＳ　ＦＯＯＴＢＡＬＬＣＬＵＢ　Ｕ－１２　Ｂ",{"$f":"(\"9\")","v":"9"},"FW","式村　龍馬","シキムラ　リョウマ",5,"男子"]
["ＫＩＮＧＳ　ＦＯＯＴＢＡＬＬＣＬＵＢ　Ｕ－１２　Ｂ_10","ＫＩＮＧＳ　ＦＯＯＴＢＡＬＬＣＬＵＢ　Ｕ－１２　Ｂ",{"$f":"(\"10\")","v":"10"},"MF","橋本　蹄弥","ハシモト　ダイヤ",5,"男子","○"]
["ＫＩＮＧＳ　ＦＯＯＴＢＡＬＬＣＬＵＢ　Ｕ－１２　Ｂ_11","ＫＩＮＧＳ　ＦＯＯＴＢＡＬＬＣＬＵＢ　Ｕ－１２　Ｂ",{"$f":"(\"11\")","v":"11"},"FW","村上　綜梧","ムラカミ　ソウゴ",5,"男子"]
["ＫＩＮＧＳ　ＦＯＯＴＢＡＬＬＣＬＵＢ　Ｕ－１２　Ｂ_12","ＫＩＮＧＳ　ＦＯＯＴＢＡＬＬＣＬＵＢ　Ｕ－１２　Ｂ",{"$f":"(\"12\")","v":"12"},"DF","高井良　成将","タカイラ　ナリマサ",5,"男子"]
["ブルーウイングフットボールクラブ_1","ブルーウイングフットボールクラブ",{"$f":"(\"1\")","v":"1"},"GK","久保田　隼斗","クボタ　ハヤト",5,"男子"]
["ブルーウイングフットボールクラブ_2","ブルーウイングフットボールクラブ",{"$f":"(\"2\")","v":"2"},"FW","秋廣　涼介","アキヒロ　リョウスケ",5,"男子"]
[{"$f":"CONCATENATE(B257,\"_\",C257)","v":"ブルーウイングフットボールクラブ_3"},"ブルーウイングフットボールクラブ",{"$f":"(\"3\")","v":"3"},"DF","宿利　未来","シュクリ　ミライ",5,"男子"]
["ブルーウイングフットボールクラブ_4","ブルーウイングフットボールクラブ",{"$f":"(\"4\")","v":"4"},"FW","麻生　珂珠","アソウ　カイジュ",5,"男子"]
["ブルーウイングフットボールクラブ_5","ブルーウイングフットボールクラブ",{"$f":"(\"5\")","v":"5"},"DF","宮本　陽向","ミヤモト　ヒナタ",5,"男子"]
["ブルーウイングフットボールクラブ_6","ブルーウイングフットボールクラブ",{"$f":"(\"6\")","v":"6"},"MF","渡邊　秀哉","ワタナベ　シュウヤ",5,"男子"]
["ブルーウイングフットボールクラブ_7","ブルーウイングフットボールクラブ",{"$f":"(\"7\")","v":"7"},"FW","池口　海","イケグチ　カイ",5,"男子"]
["ブルーウイングフットボールクラブ_8","ブルーウイングフットボールクラブ",{"$f":"(\"8\")","v":"8"},"DF","田村　蓮人","タムラ　レント",5,"男子"]
["ブルーウイングフットボールクラブ_9","ブルーウイングフットボールクラブ",{"$f":"(\"9\")","v":"9"},"DF","諸永　徠斗","モロナガ　ライト",5,"男子"]
["ブルーウイングフットボールクラブ_10","ブルーウイングフットボールクラブ",{"$f":"(\"10\")","v":"10"},"MF","奈良　三志朗","ナラ　サンシロウ",5,"男子","○"]
["ブルーウイングフットボールクラブ_11","ブルーウイングフットボールクラブ",{"$f":"(\"11\")","v":"11"},"FW","神野　蒼太","カミノ　ソウタ",5,"男子"]
["ブルーウイングフットボールクラブ_12","ブルーウイングフットボールクラブ",{"$f":"(\"12\")","v":"12"},"DF","安藤　亮太","アンドウ　リョウタ",5,"男子"]
["ブルーウイングフットボールクラブ_13","ブルーウイングフットボールクラブ",{"$f":"(\"13\")","v":"13"},"MF","板井　惺央","イタイ　セイマ",5,"男子"]
["ブルーウイングフットボールクラブ_14","ブルーウイングフットボールクラブ",{"$f":"(\"14\")","v":"14"},"MF","古川　士道","フルカワ　シドウ",4,"男子"]
["ブルーウイングフットボールクラブ_15","ブルーウイングフットボールクラブ",{"$f":"(\"15\")","v":"15"},"FW","村岡　俊","ムラオカ　シュン",4,"男子",null,"御津サッカースポーツ少年団"]
["ブルーウイングフットボールクラブ_16","ブルーウイングフットボールクラブ",{"$f":"(\"16\")","v":"16"},"DF","廣川　敬太","ヒロカワ　ケイタ",4,"男子",null,"戸次吉野ＳＳＳ"]
["ＦＣ　ＲＥＧＡＴＥ_1","ＦＣ　ＲＥＧＡＴＥ",{"$f":"(\"1\")","v":"1"},"GK","村上　葵","ムラカミ　アオイ",5,"男子"]
["ＦＣ　ＲＥＧＡＴＥ_2","ＦＣ　ＲＥＧＡＴＥ",{"$f":"(\"2\")","v":"2"},"DF","安部　一洸","アベ　イッキ",5,"男子"]
["ＦＣ　ＲＥＧＡＴＥ_4","ＦＣ　ＲＥＧＡＴＥ",{"$f":"(\"4\")","v":"4"},"DF","山本　大雅","ヤマモト　タイガ",5,"男子"]
["ＦＣ　ＲＥＧＡＴＥ_5","ＦＣ　ＲＥＧＡＴＥ",{"$f":"(\"5\")","v":"5"},"DF","塚本　迅平","ツカモト　ジンペイ",5,"男子"]
["ＦＣ　ＲＥＧＡＴＥ_6","ＦＣ　ＲＥＧＡＴＥ",{"$f":"(\"6\")","v":"6"},"MF","鈴木　乃斗","スズキ　ナイト",4,"男子"]
["ＦＣ　ＲＥＧＡＴＥ_7","ＦＣ　ＲＥＧＡＴＥ",{"$f":"(\"7\")","v":"7"},"MF","嵜野　晴翔","サキノ　ハルト",5,"男子","○"]
["ＦＣ　ＲＥＧＡＴＥ_8","ＦＣ　ＲＥＧＡＴＥ",{"$f":"(\"8\")","v":"8"},"DF","小泉　凛空","コイズミ　リク",5,"女子小学生"]
["ＦＣ　ＲＥＧＡＴＥ_9","ＦＣ　ＲＥＧＡＴＥ",{"$f":"(\"9\")","v":"9"},"MF","鶴原　仁人","ツルハラ　ヨシト",5,"男子"]
["ＦＣ　ＲＥＧＡＴＥ_10","ＦＣ　ＲＥＧＡＴＥ",{"$f":"(\"10\")","v":"10"},"FW","後藤　碧斗","ゴトウ　アオト",5,"男子"]
["ＦＣ　ＲＥＧＡＴＥ_11","ＦＣ　ＲＥＧＡＴＥ",{"$f":"(\"11\")","v":"11"},"DF","後藤　琢心","ゴトウ　タクマ",5,"男子"]
["ＦＣ　ＲＥＧＡＴＥ_12","ＦＣ　ＲＥＧＡＴＥ",{"$f":"(\"12\")","v":"12"},"FW","後藤　滉希","ゴトウ　ヒロキ",4,"男子"]
["ＦＣ　ＲＥＧＡＴＥ_13","ＦＣ　ＲＥＧＡＴＥ",{"$f":"(\"13\")","v":"13"},"DF","森山　知佳","モリヤマ　チカ",4,"女子小学生"]
["ＦＣ　ＲＥＧＡＴＥ_14","ＦＣ　ＲＥＧＡＴＥ",{"$f":"(\"14\")","v":"14"},"FW","三ヶ尻　圭吾","ミカジリ　ケイゴ",3,"男子"]
["ＦＣ　ＲＥＧＡＴＥ_15","ＦＣ　ＲＥＧＡＴＥ",{"$f":"(\"15\")","v":"15"},"FW","志賀　優弥","シガ　ユウヤ",3,"男子"]
["ＦＣ　ＲＥＧＡＴＥ_16","ＦＣ　ＲＥＧＡＴＥ",{"$f":"(\"16\")","v":"16"},"FW","江藤　颯真","エトウ　ソウマ",4,"男子"]
["ＦＣ　ＲＥＧＡＴＥ_20","ＦＣ　ＲＥＧＡＴＥ",{"$f":"(\"20\")","v":"20"},"GK","矢野　晃也","ヤノ　アキヤ",4,"男子"]
["津久見サッカースポーツ少年団_1","津久見サッカースポーツ少年団",{"$f":"(\"1\")","v":"1"},"GK","宮本　怜旺","ミヤモト　レオ",4,"男子"]
["津久見サッカースポーツ少年団_3","津久見サッカースポーツ少年団",{"$f":"(\"3\")","v":"3"},"DF","岩﨑　蓮","イワサキ　レン",3,"男子"]
["津久見サッカースポーツ少年団_5","津久見サッカースポーツ少年団",{"$f":"(\"5\")","v":"5"},"MF","染矢　涼志","ソメヤ　リョウジ",3,"男子"]
["津久見サッカースポーツ少年団_6","津久見サッカースポーツ少年団",{"$f":"(\"6\")","v":"6"},"DF","山﨑　世大","ヤマサキ　セオ",4,"男子"]
["津久見サッカースポーツ少年団_9","津久見サッカースポーツ少年団",{"$f":"(\"9\")","v":"9"},"FW","大河　聡","オオカワ　ソウ",4,"男子","○"]
["津久見サッカースポーツ少年団_14","津久見サッカースポーツ少年団",{"$f":"(\"14\")","v":"14"},"MF","石井　湊人","イシイ　ミナト",3,"男子"]
["津久見サッカースポーツ少年団_15","津久見サッカースポーツ少年団",{"$f":"(\"15\")","v":"15"},"MF","岩﨑　冬輝","イワサキ　トウキ",2,"男子"]
["津久見サッカースポーツ少年団_16","津久見サッカースポーツ少年団",{"$f":"(\"16\")","v":"16"},"FW","木許　賀琥","キモト　ガク",1,"男子"]
["津久見サッカースポーツ少年団_17","津久見サッカースポーツ少年団",{"$f":"(\"17\")","v":"17"},"FW","松井　健太郎","マツイ　ケンタロウ",1,"男子"]
["太陽スポーツクラブ大分西_1","太陽スポーツクラブ大分西",{"$f":"(\"1\")","v":"1"},"GK","坂本　帆駿","サカモト　ホタカ",5,"男子"]
["太陽スポーツクラブ大分西_2","太陽スポーツクラブ大分西",{"$f":"(\"2\")","v":"2"},"DF","山﨑　康大","ヤマサキ　コウダイ",4,"男子"]
["太陽スポーツクラブ大分西_3","太陽スポーツクラブ大分西",{"$f":"(\"3\")","v":"3"},"FW","東　侑平","ヒガシ　ユウヘイ",5,"男子"]
["太陽スポーツクラブ大分西_4","太陽スポーツクラブ大分西",{"$f":"(\"4\")","v":"4"},"DF","山岡　湧斗","ヤマオカ　ユウト",5,"男子"]
["太陽スポーツクラブ大分西_5","太陽スポーツクラブ大分西",{"$f":"(\"5\")","v":"5"},"MF","中山　夏帆","ナカヤマ　カホ",5,"女子小学生"]
["太陽スポーツクラブ大分西_6","太陽スポーツクラブ大分西",{"$f":"(\"6\")","v":"6"},"MF","中山　凉","ナカヤマ　スズ",5,"女子小学生"]
["太陽スポーツクラブ大分西_7","太陽スポーツクラブ大分西",{"$f":"(\"7\")","v":"7"},"FW","中島　歩夢","ナカシマ　アユム",4,"男子"]
["太陽スポーツクラブ大分西_8","太陽スポーツクラブ大分西",{"$f":"(\"8\")","v":"8"},"MF","木下　蓮","キノシタ　レン",5,"男子"]
["太陽スポーツクラブ大分西_9","太陽スポーツクラブ大分西",{"$f":"(\"9\")","v":"9"},"MF","岐部　颯平","キベ　ソウヘイ",5,"男子"]
["太陽スポーツクラブ大分西_10","太陽スポーツクラブ大分西",{"$f":"(\"10\")","v":"10"},"DF","岩澤　春弥","イワサワ　ハルヤ",5,"男子"]
["太陽スポーツクラブ大分西_11","太陽スポーツクラブ大分西",{"$f":"(\"11\")","v":"11"},"MF","進藤　晃太","シンドウ　コウタ",5,"男子","○"]
["太陽スポーツクラブ大分西_15","太陽スポーツクラブ大分西",{"$f":"(\"15\")","v":"15"},"MF","堀田　詞音","ホリタ　シオン",4,"男子"]
["太陽スポーツクラブ大分西_16","太陽スポーツクラブ大分西",{"$f":"(\"16\")","v":"16"},"GK","財津　璃大","ザイツ　リョウ",5,"男子"]
["太陽スポーツクラブ大分西_18","太陽スポーツクラブ大分西",{"$f":"(\"18\")","v":"18"},"MF","河津　瑛斗","カワヅ　アキト",4,"男子"]
["太陽スポーツクラブ大分西_19","太陽スポーツクラブ大分西",{"$f":"(\"19\")","v":"19"},"FW","江田　侑翔","コウダ　ユウト",4,"男子"]
["太陽スポーツクラブ大分西_20","太陽スポーツクラブ大分西",{"$f":"(\"20\")","v":"20"},"MF","高野　真音","タカノ　マコト",4,"男子"]
["カティオーラフットボールクラブ　高城_1","カティオーラフットボールクラブ　高城",{"$f":"(\"1\")","v":"1"},"GK","村田　大翔","ムラタ　ハルト",5,"男子"]
["カティオーラフットボールクラブ　高城_2","カティオーラフットボールクラブ　高城",{"$f":"(\"2\")","v":"2"},"FW","後藤　蒼人","ゴトウ　アオト",5,"男子"]
["カティオーラフットボールクラブ　高城_3","カティオーラフットボールクラブ　高城",{"$f":"(\"3\")","v":"3"},"MF","小川　凌輔","オガワ　リョウスケ",5,"男子"]
["カティオーラフットボールクラブ　高城_4","カティオーラフットボールクラブ　高城",{"$f":"(\"4\")","v":"4"},"MF","小田　晴之介","オダ　セイノスケ",5,"男子"]
["カティオーラフットボールクラブ　高城_5","カティオーラフットボールクラブ　高城",{"$f":"(\"5\")","v":"5"},"DF","浜小路　颯真","ハマショウジ　ソウマ",5,"男子",null,"カティオーラフットボールクラブ七瀬"]
["カティオーラフットボールクラブ　高城_6","カティオーラフットボールクラブ　高城",{"$f":"(\"6\")","v":"6"},"FW","佐藤　慈瑛","サトウ　ジエイ",5,"男子"]
["カティオーラフットボールクラブ　高城_7","カティオーラフットボールクラブ　高城",{"$f":"(\"7\")","v":"7"},"MF","村上　温俊","ムラカミ　ハルト",5,"男子"]
["カティオーラフットボールクラブ　高城_8","カティオーラフットボールクラブ　高城",{"$f":"(\"8\")","v":"8"},"FW","松田　翔空","マツダ　トア",5,"男子",null,"カティオーラフットボールクラブ七瀬"]
["カティオーラフットボールクラブ　高城_9","カティオーラフットボールクラブ　高城",{"$f":"(\"9\")","v":"9"},"DF","奥田　智己","オクダ　トモキ",5,"男子"]
[{"$f":"CONCATENATE(B321,\"_\",C321)","v":"カティオーラフットボールクラブ　高城_10"},"カティオーラフットボールクラブ　高城",{"$f":"(\"10\")","v":"10"},"MF","吉元　俊輔","ヨシモト　シュンスケ",5,"男子","○","青江小　サッカースポーツ少年団"]
["カティオーラフットボールクラブ　高城_11","カティオーラフットボールクラブ　高城",{"$f":"(\"11\")","v":"11"},"FW","幸重　徹平","ユキシゲ　テッペイ",5,"男子"]
["カティオーラフットボールクラブ　高城_12","カティオーラフットボールクラブ　高城",{"$f":"(\"12\")","v":"12"},"MF","熊谷　颯人","クマガイ　ハヤト",4,"男子"]
["カティオーラフットボールクラブ　高城_13","カティオーラフットボールクラブ　高城",{"$f":"(\"13\")","v":"13"},"MF","野尻　憲慎","ノジリ　ケンシン",4,"男子"]
["カティオーラフットボールクラブ　高城_14","カティオーラフットボールクラブ　高城",{"$f":"(\"14\")","v":"14"},"FW","花宮　蓮","ハナミヤ　レン",4,"男子"]
["カティオーラフットボールクラブ　高城_15","カティオーラフットボールクラブ　高城",{"$f":"(\"15\")","v":"15"},"DF","豊田　葵","トヨダ　アオイ",4,"男子",null,"桃園サッカースポーツ少年団"]
["カティオーラフットボールクラブ　高城_16","カティオーラフットボールクラブ　高城",{"$f":"(\"16\")","v":"16"},"MF","齋藤　大翔","サイトウ　ハルト",4,"男子"]
["ＭＳＳ_1","ＭＳＳ",{"$f":"(\"1\")","v":"1"},"GK","二宮　拓篤","ニノミヤ　タクマ",5,"男子",null,"森岡サッカースポーツ少年団"]
["ＭＳＳ_4","ＭＳＳ",{"$f":"(\"4\")","v":"4"},"DF","南里　仁士","ナンリ　ヒロト",5,"男子"]
["ＭＳＳ_5","ＭＳＳ",{"$f":"(\"5\")","v":"5"},"FW","赤峰　功己","アカミネ　イサミ",5,"男子",null,"春日ＳＳＳ"]
["ＭＳＳ_6","ＭＳＳ",{"$f":"(\"6\")","v":"6"},"FW","片島　啓太","カタシマ　ケイタ",5,"男子"]
["ＭＳＳ_7","ＭＳＳ",{"$f":"(\"7\")","v":"7"},"MF","渡邊　丈輝","ワタナベ　トモキ",5,"男子",null,"ヴィンクラッソ大分ＦＣジュニア"]
["ＭＳＳ_8","ＭＳＳ",{"$f":"(\"8\")","v":"8"},"MF","後藤　塁","ゴトウ　ルイ",4,"男子"]
["ＭＳＳ_9","ＭＳＳ",{"$f":"(\"9\")","v":"9"},"MF","石川　遥大","イシカワ　ヨウタ",4,"男子",null,"東根少年サッカークラブ"]
["ＭＳＳ_10","ＭＳＳ",{"$f":"(\"10\")","v":"10"},"MF","中川　天蒼","ナカガワ　ソラ",5,"男子","○","西の台ＪＦＣ"]
["ＭＳＳ_11","ＭＳＳ",{"$f":"(\"11\")","v":"11"},"FW","山本　一晟","ヤマモト　イッセイ",5,"男子"]
["ＭＳＳ_12","ＭＳＳ",{"$f":"(\"12\")","v":"12"},"MF","中西　俊喜","ナカニシ　トシキ",5,"男子",null,"大平山アソシエーション式フットボールクラブ"]
["ＭＳＳ_13","ＭＳＳ",{"$f":"(\"13\")","v":"13"},"MF","吉田　光","ヨシダ　ヒカル",5,"男子"]
["ＭＳＳ_14","ＭＳＳ",{"$f":"(\"14\")","v":"14"},"DF","高野　将大","タカノ　マサヒロ",5,"男子"]
["ＭＳＳ_15","ＭＳＳ",{"$f":"(\"15\")","v":"15"},"DF","川野　公聖","カワノ　コウセイ",4,"男子"]
["ＭＳＳ_17","ＭＳＳ",{"$f":"(\"17\")","v":"17"},"MF","高濱　蒼太","タカハマ　ソウタ",5,"男子",null,"ＭＩＲＡＩＯ　ＦＣ"]
["ＭＳＳ_18","ＭＳＳ",{"$f":"(\"18\")","v":"18"},"FW","高松　我空","タカマツ　ガイア",4,"男子"]

{"sheet":"項目","index":19,"n_rows":17,"n_cols":3,"rows_kept":17,"cut":false,"hidden":true,"merged":[]}
["警告/退場",null,"＜警告選択肢＞"]
["警告",null,"反スポ"]
["退場",null,"ラフ"]
["警告(累積2枚目次節出場停止）",null,"異議"]
[null,null,"繰り返し"]
[null,null,"遅延"]
[null,null,"距離"]
[null,null,"無断入"]
[null,null,"無断去"]
[null,null,"＜退場選択肢＞"]
[null,null,"不正"]
[null,null,"乱暴"]
[null,null,"つば"]
[null,null,"阻止(手)"]
[null,null,"阻止(他)"]
[null,null,"暴言"]
[null,null,"警告2"]